{"text_format":"1","workbook":"xlsx","n_sheets":6,"sheets":["rooster en stand","kalender","export html","spelersstatistieken","Topschutters","Stats"],"not_rendered":{"charts":0,"images":13,"macros":1,"external_links":0,"defined_names":36,"comments":2,"pivot_tables":0},"unopened":[],"bounds":{"document_bytes":16777216,"sheet_cells":100000,"rows_first":2000,"rows_last":500,"rows_between":2000,"halvings":0,"cell_chars":16384,"cell_head_chars":4096},"cells_cut":0,"cells_raw":0,"read":"whole","date_system":"1900"}

{"sheet":"rooster en stand","index":0,"n_rows":49,"n_cols":104,"rows_kept":49,"cut":false,"hidden":false,"merged":[[2,36,3,36],[2,49,3,49],[2,47,3,47],[2,42,3,42],[2,24,3,24],[2,34,3,34],[2,48,3,48],[2,57,3,57],[2,51,3,51],[2,52,3,52],[2,53,3,53],[2,54,3,54],[2,55,3,55],[2,56,3,56],[2,50,3,50],[2,27,3,27],[2,28,3,28],[2,25,3,25],[2,26,3,26],[2,46,3,46],[2,43,3,43],[2,30,3,30],[2,31,3,31],[2,32,3,32],[2,33,3,33],[2,38,3,38],[2,37,3,37],[2,39,3,39],[2,40,3,40],[2,41,3,41],[20,5,20,7],[2,44,3,44],[2,45,3,45],[2,19,3,19],[2,20,3,20],[2,29,3,29],[2,18,3,18],[2,2,2,7],[3,5,3,6],[2,15,3,15],[2,16,3,16],[2,17,3,17],[2,23,3,23],[2,21,3,21],[2,22,3,22],[2,35,3,35]]}
[]
[null,null,"Updated:","2024-10-08T23:49:44",null,"© 2024/2025 - Wim Gielis - wim.gielis@gmail.com - https://www.wimgielis.com"]
[null,null,"LUCYVO",null,null,null,null,null,null,null,null,null,null,null,null,null,{"$f":"P5","v":"Alberta Schilde"},{"$f":"P6","v":"Antwerp Global"},{"$f":"P7","v":"Bar Patron"},{"$f":"P8","v":"Bariton"},{"$f":"P9","v":"Corum"},{"$f":"P10","v":"Daltons"},{"$f":"P11","v":"Goka"},{"$f":"P12","v":"Hombeek"},{"$f":"P13","v":"Jolika"},{"$f":"P14","v":"Lucyvo"},{"$f":"P15","v":"Racing Emblem"},{"$f":"P16","v":"Sint Anneke"},{"$f":"P17","v":"SC Duffel"},{"$f":"P18","v":"Yerevan United"},{"$f":"P5","v":"Alberta Schilde"},{"$f":"P6","v":"Antwerp Global"},{"$f":"P7","v":"Bar Patron"},{"$f":"P8","v":"Bariton"},{"$f":"P9","v":"Corum"},{"$f":"P10","v":"Daltons"},{"$f":"P11","v":"Goka"},{"$f":"P12","v":"Hombeek"},{"$f":"P13","v":"Jolika"},{"$f":"P14","v":"Lucyvo"},{"$f":"P15","v":"Racing Emblem"},{"$f":"P16","v":"Sint Anneke"},{"$f":"P17","v":"SC Duffel"},{"$f":"P18","v":"Yerevan United"},{"$f":"P5","v":"Alberta Schilde"},{"$f":"P6","v":"Antwerp Global"},{"$f":"P7","v":"Bar Patron"},{"$f":"P8","v":"Bariton"},{"$f":"P9","v":"Corum"},{"$f":"P10","v":"Daltons"},{"$f":"P11","v":"Goka"},{"$f":"P12","v":"Hombeek"},{"$f":"P13","v":"Jolika"},{"$f":"P14","v":"Lucyvo"},{"$f":"P15","v":"Racing Emblem"},{"$f":"P16","v":"Sint Anneke"},{"$f":"P17","v":"SC Duffel"},{"$f":"P18","v":"Yerevan United"}]
[null,null,null,"Ploeg","P","M",null,"W","V","G","+","-","S","VP",null,null,null,null,null,null,null,null,null,null,null,null,null,null,null,null,null,null,null,null,null,null,null,null,null,null,null,null,null,null,null,null,null,null,null,null,null,null,null,null,null,null,null,null,null,"Coëfficiënt","Ploeg","Punten","Matchen","W","V","G","D+","D-","DS","Ff","Nr","Coëf sorted",null,null,1,2,3,4,5,6,7,8,9,10,11,12,13,14,null,1,2,3,4,5,6,7,8,9,10,11,12,13,14]
[null,null,1,{"$f":"VLOOKUP(BT5,HulpberekeningenStand,2,FALSE)","v":"Daltons"},{"$f":"3*H5+J5","v":18},{"$f":"SUM(H5:J5)","v":6},{"$f":"REPT(IF(F5-MODE($F$5:$F$18)<0,\"-\",\"+\"),ABS(F5-MODE($F$5:$F$18)))","v":""},{"$f":"VLOOKUP(BT5,HulpberekeningenStand,5,FALSE)","v":6},{"$f":"VLOOKUP(BT5,HulpberekeningenStand,6,FALSE)","v":0},{"$f":"VLOOKUP(BT5,HulpberekeningenStand,7,FALSE)","v":0},{"$f":"VLOOKUP(BT5,HulpberekeningenStand,8,FALSE)","v":24},{"$f":"VLOOKUP(BT5,HulpberekeningenStand,9,FALSE)","v":6},{"$f":"K5-L5","v":18},{"$f":"3*F5-E5","v":0},null,"Alberta Schilde",null,"2-0",null,null,null,null,null,null,null,null,null,"8-0",null,"2-2",null,6,8,18,14,13,22,25,10,16,20,2,11,4,null,"2024-10-06","2024-10-20","2025-02-02","2024-12-08","2024-12-01","2025-03-09","2025-03-30","2024-11-10","2025-01-19","2025-02-16","2024-09-08","2024-11-17","2024-09-22",null,{"$f":"RANK( BJ5, $BJ$5:$BJ$18, 0 ) - RANK( BK5, $BK$5:$BK$18, 0 ) / 10^2 + RANK( BL5, $BL$5:$BL$18, 0 ) / 10^4 + RANK( BQ5, $BQ$5:$BQ$18, 0 ) / 10^6 + RANK( BO5, $BO$5:$BO$18, 0 ) / 10^8 + BS5 / 10^10","v":1.9902030500999999},{"$f":"P5","v":"Alberta Schilde"},{"$f":"3 * BL5 + BN5","v":13},{"$f":"SUM( BL5:BN5 )","v":6},{"$f":"CHOOSE(StandBer,COUNTIF(BW35:CJ35,\"t\")+COUNTIF(BW35:BW48,\"u\")+COUNTIF(CL35:CY35,\"t\")+COUNTIF(CL35:CL48,\"u\"),COUNTIF(BW35:CJ35,\"t\")+COUNTIF(BW35:BW48,\"u\"),COUNTIF(CL35:CY35,\"t\")+COUNTIF(CL35:CL48,\"u\"),COUNTIF(BW35:CJ35,\"t\")+COUNTIF(CL35:CY35,\"t\"),COUNTIF(BW35:BW48,\"u\")+COUNTIF(CL35:CL48,\"u\"))","v":4},{"$f":"CHOOSE(StandBer,COUNTIF(BW35:CJ35,\"u\")+COUNTIF(BW35:BW48,\"t\")+COUNTIF(CL35:CY35,\"u\")+COUNTIF(CL35:CL48,\"t\"),COUNTIF(BW35:CJ35,\"u\")+COUNTIF(BW35:BW48,\"t\"),COUNTIF(CL35:CY35,\"u\")+COUNTIF(CL35:CL48,\"t\"),COUNTIF(BW35:CJ35,\"u\")+COUNTIF(CL35:CY35,\"u\"),COUNTIF(BW35:BW48,\"t\")+COUNTIF(CL35:CL48,\"t\"))+BR5","v":1},{"$f":"CHOOSE(StandBer,COUNTIF(BW35:CJ35,\"g\")+COUNTIF(BW35:BW48,\"g\")+COUNTIF(CL35:CY35,\"g\")+COUNTIF(CL35:CL48,\"g\"),COUNTIF(BW35:CJ35,\"g\")+COUNTIF(BW35:BW48,\"g\"),COUNTIF(CL35:CY35,\"g\")+COUNTIF(CL35:CL48,\"g\"),COUNTIF(BW35:CJ35,\"g\")+COUNTIF(CL35:CY35,\"g\"),COUNTIF(BW35:BW48,\"g\")+COUNTIF(CL35:CL48,\"g\"))","v":1},{"$f":"CHOOSE(StandBer,SUM(BW5:CJ5)+SUM(BW20:BW33)+SUM(CL5:CY5)+SUM(CL20:CL33),SUM(BW5:CJ5)+SUM(BW20:BW33),SUM(CL5:CY5)+SUM(CL20:CL33),SUM(BW5:CJ5)+SUM(CL5:CY5),SUM(BW20:BW33)+SUM(CL20:CL33))-5*BR5","v":21},{"$f":"CHOOSE(StandBer,SUM(BW5:BW18)+SUM(BW20:CJ20)+SUM(CL5:CL18)+SUM(CL20:CY20),SUM(BW5:BW18)+SUM(BW20:CJ20),SUM(CL5:CL18)+SUM(CL20:CY20),SUM(BW5:BW18)+SUM(CL5:CL18),SUM(BW20:CJ20)+SUM(CL20:CY20))","v":9},{"$f":"BO5 - BP5","v":12},{"$f":"CHOOSE(StandBer,COUNTIF(BW35:CJ35,\"ff\")+COUNTIF(BW35:BW48,\"ff\")+COUNTIF(CL35:CY35,\"ff\")+COUNTIF(CL35:CL48,\"ff\"),COUNTIF(BW35:CJ35,\"ff\")+COUNTIF(BW35:BW48,\"ff\"),COUNTIF(CL35:CY35,\"ff\")+COUNTIF(CL35:CL48,\"ff\"),COUNTIF(BW35:CJ35,\"ff\")+COUNTIF(CL35:CY35,\"ff\"),COUNTIF(BW35:BW48,\"ff\")+COUNTIF(CL35:CL48,\"ff\"))","v":0},1,{"$f":"SMALL( $BH$5:$BH$18, BS5 )","v":0.99010104060000004},null,1,null,{"$f":"IF(OR(ISERROR(FIND(\"-\",R5)),AF5>'export html'!$AR$7),\"\",IF(LEFT(R5,1)<>\"*\",LEFT(R5,FIND(\"-\",R5)-1)-0,MID(R5,2,FIND(\"-\",R5)-2)-0))","v":2},{"$f":"IF(OR(ISERROR(FIND(\"-\",S5)),AG5>'export html'!$AR$7),\"\",IF(LEFT(S5,1)<>\"*\",LEFT(S5,FIND(\"-\",S5)-1)-0,MID(S5,2,FIND(\"-\",S5)-2)-0))","v":""},{"$f":"IF(OR(ISERROR(FIND(\"-\",T5)),AH5>'export html'!$AR$7),\"\",IF(LEFT(T5,1)<>\"*\",LEFT(T5,FIND(\"-\",T5)-1)-0,MID(T5,2,FIND(\"-\",T5)-2)-0))","v":""},{"$f":"IF(OR(ISERROR(FIND(\"-\",U5)),AI5>'export html'!$AR$7),\"\",IF(LEFT(U5,1)<>\"*\",LEFT(U5,FIND(\"-\",U5)-1)-0,MID(U5,2,FIND(\"-\",U5)-2)-0))","v":""},{"$f":"IF(OR(ISERROR(FIND(\"-\",V5)),AJ5>'export html'!$AR$7),\"\",IF(LEFT(V5,1)<>\"*\",LEFT(V5,FIND(\"-\",V5)-1)-0,MID(V5,2,FIND(\"-\",V5)-2)-0))","v":""},{"$f":"IF(OR(ISERROR(FIND(\"-\",W5)),AK5>'export html'!$AR$7),\"\",IF(LEFT(W5,1)<>\"*\",LEFT(W5,FIND(\"-\",W5)-1)-0,MID(W5,2,FIND(\"-\",W5)-2)-0))","v":""},{"$f":"IF(OR(ISERROR(FIND(\"-\",X5)),AL5>'export html'!$AR$7),\"\",IF(LEFT(X5,1)<>\"*\",LEFT(X5,FIND(\"-\",X5)-1)-0,MID(X5,2,FIND(\"-\",X5)-2)-0))","v":""},{"$f":"IF(OR(ISERROR(FIND(\"-\",Y5)),AM5>'export html'!$AR$7),\"\",IF(LEFT(Y5,1)<>\"*\",LEFT(Y5,FIND(\"-\",Y5)-1)-0,MID(Y5,2,FIND(\"-\",Y5)-2)-0))","v":""},{"$f":"IF(OR(ISERROR(FIND(\"-\",Z5)),AN5>'export html'!$AR$7),\"\",IF(LEFT(Z5,1)<>\"*\",LEFT(Z5,FIND(\"-\",Z5)-1)-0,MID(Z5,2,FIND(\"-\",Z5)-2)-0))","v":""},{"$f":"IF(OR(ISERROR(FIND(\"-\",AA5)),AO5>'export html'!$AR$7),\"\",IF(LEFT(AA5,1)<>\"*\",LEFT(AA5,FIND(\"-\",AA5)-1)-0,MID(AA5,2,FIND(\"-\",AA5)-2)-0))","v":""},{"$f":"IF(OR(ISERROR(FIND(\"-\",AB5)),AP5>'export html'!$AR$7),\"\",IF(LEFT(AB5,1)<>\"*\",LEFT(AB5,FIND(\"-\",AB5)-1)-0,MID(AB5,2,FIND(\"-\",AB5)-2)-0))","v":8},{"$f":"IF(OR(ISERROR(FIND(\"-\",AC5)),AQ5>'export html'!$AR$7),\"\",IF(LEFT(AC5,1)<>\"*\",LEFT(AC5,FIND(\"-\",AC5)-1)-0,MID(AC5,2,FIND(\"-\",AC5)-2)-0))","v":""},{"$f":"IF(OR(ISERROR(FIND(\"-\",AD5)),AR5>'export html'!$AR$7),\"\",IF(LEFT(AD5,1)<>\"*\",LEFT(AD5,FIND(\"-\",AD5)-1)-0,MID(AD5,2,FIND(\"-\",AD5)-2)-0))","v":2},1,null,{"$f":"IF(OR(ISERROR(FIND(\"-\",R5)),AF5<='export html'!$AR$7),\"\",IF(LEFT(R5,1)<>\"*\",LEFT(R5,FIND(\"-\",R5)-1)-0,MID(R5,2,FIND(\"-\",R5)-2)-0))","v":""},{"$f":"IF(OR(ISERROR(FIND(\"-\",S5)),AG5<='export html'!$AR$7),\"\",IF(LEFT(S5,1)<>\"*\",LEFT(S5,FIND(\"-\",S5)-1)-0,MID(S5,2,FIND(\"-\",S5)-2)-0))","v":""},{"$f":"IF(OR(ISERROR(FIND(\"-\",T5)),AH5<='export html'!$AR$7),\"\",IF(LEFT(T5,1)<>\"*\",LEFT(T5,FIND(\"-\",T5)-1)-0,MID(T5,2,FIND(\"-\",T5)-2)-0))","v":""},{"$f":"IF(OR(ISERROR(FIND(\"-\",U5)),AI5<='export html'!$AR$7),\"\",IF(LEFT(U5,1)<>\"*\",LEFT(U5,FIND(\"-\",U5)-1)-0,MID(U5,2,FIND(\"-\",U5)-2)-0))","v":""},{"$f":"IF(OR(ISERROR(FIND(\"-\",V5)),AJ5<='export html'!$AR$7),\"\",IF(LEFT(V5,1)<>\"*\",LEFT(V5,FIND(\"-\",V5)-1)-0,MID(V5,2,FIND(\"-\",V5)-2)-0))","v":""},{"$f":"IF(OR(ISERROR(FIND(\"-\",W5)),AK5<='export html'!$AR$7),\"\",IF(LEFT(W5,1)<>\"*\",LEFT(W5,FIND(\"-\",W5)-1)-0,MID(W5,2,FIND(\"-\",W5)-2)-0))","v":""},{"$f":"IF(OR(ISERROR(FIND(\"-\",X5)),AL5<='export html'!$AR$7),\"\",IF(LEFT(X5,1)<>\"*\",LEFT(X5,FIND(\"-\",X5)-1)-0,MID(X5,2,FIND(\"-\",X5)-2)-0))","v":""},{"$f":"IF(OR(ISERROR(FIND(\"-\",Y5)),AM5<='export html'!$AR$7),\"\",IF(LEFT(Y5,1)<>\"*\",LEFT(Y5,FIND(\"-\",Y5)-1)-0,MID(Y5,2,FIND(\"-\",Y5)-2)-0))","v":""},{"$f":"IF(OR(ISERROR(FIND(\"-\",Z5)),AN5<='export html'!$AR$7),\"\",IF(LEFT(Z5,1)<>\"*\",LEFT(Z5,FIND(\"-\",Z5)-1)-0,MID(Z5,2,FIND(\"-\",Z5)-2)-0))","v":""},{"$f":"IF(OR(ISERROR(FIND(\"-\",AA5)),AO5<='export html'!$AR$7),\"\",IF(LEFT(AA5,1)<>\"*\",LEFT(AA5,FIND(\"-\",AA5)-1)-0,MID(AA5,2,FIND(\"-\",AA5)-2)-0))","v":""},{"$f":"IF(OR(ISERROR(FIND(\"-\",AB5)),AP5<='export html'!$AR$7),\"\",IF(LEFT(AB5,1)<>\"*\",LEFT(AB5,FIND(\"-\",AB5)-1)-0,MID(AB5,2,FIND(\"-\",AB5)-2)-0))","v":""},{"$f":"IF(OR(ISERROR(FIND(\"-\",AC5)),AQ5<='export html'!$AR$7),\"\",IF(LEFT(AC5,1)<>\"*\",LEFT(AC5,FIND(\"-\",AC5)-1)-0,MID(AC5,2,FIND(\"-\",AC5)-2)-0))","v":""},{"$f":"IF(OR(ISERROR(FIND(\"-\",AD5)),AR5<='export html'!$AR$7),\"\",IF(LEFT(AD5,1)<>\"*\",LEFT(AD5,FIND(\"-\",AD5)-1)-0,MID(AD5,2,FIND(\"-\",AD5)-2)-0))","v":""},1]
[null,null,{"$f":"IF(RANK(E6,$E$5:$E$18,0)>RANK(E5,$E$5:$E$18,0),RANK(E6,$E$5:$E$18,0),\"\")","v":2},{"$f":"VLOOKUP(BT6,HulpberekeningenStand,2,FALSE)","v":"Bar Patron"},13,6,{"$f":"REPT(IF(F6-MODE($F$5:$F$18)<0,\"-\",\"+\"),ABS(F6-MODE($F$5:$F$18)))","v":""},{"$f":"VLOOKUP(BT6,HulpberekeningenStand,5,FALSE)","v":4},{"$f":"VLOOKUP(BT6,HulpberekeningenStand,6,FALSE)","v":1},{"$f":"VLOOKUP(BT6,HulpberekeningenStand,7,FALSE)","v":1},{"$f":"VLOOKUP(BT6,HulpberekeningenStand,8,FALSE)","v":25},{"$f":"VLOOKUP(BT6,HulpberekeningenStand,9,FALSE)","v":13},12,5,null,"Antwerp Global",null,null,null,null,null,null,"3-1",null,"*5-0",null,"4-3",null,null,null,19,null,17,14,23,9,5,21,2,25,3,11,7,13,"2025-02-09",null,"2025-01-26","2024-12-08","2025-03-16","2024-11-03","2024-09-29","2025-02-23","2024-09-08","2025-03-30","2024-09-15","2024-11-17","2024-10-13","2024-12-01",null,{"$f":"RANK( BJ6, $BJ$5:$BJ$18, 0 ) - RANK( BK6, $BK$5:$BK$18, 0 ) / 10^2 + RANK( BL6, $BL$5:$BL$18, 0 ) / 10^4 + RANK( BQ6, $BQ$5:$BQ$18, 0 ) / 10^6 + RANK( BO6, $BO$5:$BO$18, 0 ) / 10^8 + BS6 / 10^10","v":3.9902050502000002},"Antwerp Global",{"$f":"3 * BL6 + BN6","v":12},{"$f":"SUM( BL6:BN6 )","v":6},{"$f":"CHOOSE(StandBer,COUNTIF(BW36:CJ36,\"t\")+COUNTIF(BX35:BX48,\"u\")+COUNTIF(CL36:CY36,\"t\")+COUNTIF(CM35:CM48,\"u\"),COUNTIF(BW36:CJ36,\"t\")+COUNTIF(BX35:BX48,\"u\"),COUNTIF(CL36:CY36,\"t\")+COUNTIF(CM35:CM48,\"u\"),COUNTIF(BW36:CJ36,\"t\")+COUNTIF(CL36:CY36,\"t\"),COUNTIF(BX35:BX48,\"u\")+COUNTIF(CM35:CM48,\"u\"))","v":4},{"$f":"CHOOSE(StandBer,COUNTIF(BW36:CJ36,\"u\")+COUNTIF(BX35:BX48,\"t\")+COUNTIF(CL36:CY36,\"u\")+COUNTIF(CM35:CM48,\"t\"),COUNTIF(BW36:CJ36,\"u\")+COUNTIF(BX35:BX48,\"t\"),COUNTIF(CL36:CY36,\"u\")+COUNTIF(CM35:CM48,\"t\"),COUNTIF(BW36:CJ36,\"u\")+COUNTIF(CL36:CY36,\"u\"),COUNTIF(BX35:BX48,\"t\")+COUNTIF(CM35:CM48,\"t\"))+BR6","v":2},{"$f":"CHOOSE(StandBer,COUNTIF(BW36:CJ36,\"g\")+COUNTIF(BX35:BX48,\"g\")+COUNTIF(CL36:CY36,\"g\")+COUNTIF(CM35:CM48,\"g\"),COUNTIF(BW36:CJ36,\"g\")+COUNTIF(BX35:BX48,\"g\"),COUNTIF(CL36:CY36,\"g\")+COUNTIF(CM35:CM48,\"g\"),COUNTIF(BW36:CJ36,\"g\")+COUNTIF(CL36:CY36,\"g\"),COUNTIF(BX35:BX48,\"g\")+COUNTIF(CM35:CM48,\"g\"))","v":0},{"$f":"CHOOSE(StandBer,SUM(BW6:CJ6)+SUM(BX20:BX33)+SUM(CL6:CY6)+SUM(CM20:CM33),SUM(BW6:CJ6)+SUM(BX20:BX33),SUM(CL6:CY6)+SUM(CM20:CM33),SUM(BW6:CJ6)+SUM(CL6:CY6),SUM(BX20:BX33)+SUM(CM20:CM33))-5*BR6","v":21},{"$f":"CHOOSE(StandBer,SUM(BX5:BX18)+SUM(BW21:CJ21)+SUM(CM5:CM18)+SUM(CL21:CY21),SUM(BX5:BX18)+SUM(BW21:CJ21),SUM(CM5:CM18)+SUM(CL21:CY21),SUM(BX5:BX18)+SUM(CM5:CM18),SUM(BW21:CJ21)+SUM(CL21:CY21))","v":12},{"$f":"BO6 - BP6","v":9},{"$f":"CHOOSE(StandBer,COUNTIF(BW36:CJ36,\"ff\")+COUNTIF(BX35:BX48,\"ff\")+COUNTIF(CL36:CY36,\"ff\")+COUNTIF(CM35:CM48,\"ff\"),COUNTIF(BW36:CJ36,\"ff\")+COUNTIF(BX35:BX48,\"ff\"),COUNTIF(CL36:CY36,\"ff\")+COUNTIF(CM35:CM48,\"ff\"),COUNTIF(BW36:CJ36,\"ff\")+COUNTIF(CL36:CY36,\"ff\"),COUNTIF(BX35:BX48,\"ff\")+COUNTIF(CM35:CM48,\"ff\"))","v":0},2,{"$f":"SMALL( $BH$5:$BH$18, BS6 )","v":1.9902030303},null,2,{"$f":"IF(OR(ISERROR(FIND(\"-\",Q6)),AE6>'export html'!$AR$7),\"\",IF(LEFT(Q6,1)<>\"*\",LEFT(Q6,FIND(\"-\",Q6)-1)-0,MID(Q6,2,FIND(\"-\",Q6)-2)-0))","v":""},null,{"$f":"IF(OR(ISERROR(FIND(\"-\",S6)),AG6>'export html'!$AR$7),\"\",IF(LEFT(S6,1)<>\"*\",LEFT(S6,FIND(\"-\",S6)-1)-0,MID(S6,2,FIND(\"-\",S6)-2)-0))","v":""},{"$f":"IF(OR(ISERROR(FIND(\"-\",T6)),AH6>'export html'!$AR$7),\"\",IF(LEFT(T6,1)<>\"*\",LEFT(T6,FIND(\"-\",T6)-1)-0,MID(T6,2,FIND(\"-\",T6)-2)-0))","v":""},{"$f":"IF(OR(ISERROR(FIND(\"-\",U6)),AI6>'export html'!$AR$7),\"\",IF(LEFT(U6,1)<>\"*\",LEFT(U6,FIND(\"-\",U6)-1)-0,MID(U6,2,FIND(\"-\",U6)-2)-0))","v":""},{"$f":"IF(OR(ISERROR(FIND(\"-\",V6)),AJ6>'export html'!$AR$7),\"\",IF(LEFT(V6,1)<>\"*\",LEFT(V6,FIND(\"-\",V6)-1)-0,MID(V6,2,FIND(\"-\",V6)-2)-0))","v":""},{"$f":"IF(OR(ISERROR(FIND(\"-\",W6)),AK6>'export html'!$AR$7),\"\",IF(LEFT(W6,1)<>\"*\",LEFT(W6,FIND(\"-\",W6)-1)-0,MID(W6,2,FIND(\"-\",W6)-2)-0))","v":3},{"$f":"IF(OR(ISERROR(FIND(\"-\",X6)),AL6>'export html'!$AR$7),\"\",IF(LEFT(X6,1)<>\"*\",LEFT(X6,FIND(\"-\",X6)-1)-0,MID(X6,2,FIND(\"-\",X6)-2)-0))","v":""},{"$f":"IF(OR(ISERROR(FIND(\"-\",Y6)),AM6>'export html'!$AR$7),\"\",IF(LEFT(Y6,1)<>\"*\",LEFT(Y6,FIND(\"-\",Y6)-1)-0,MID(Y6,2,FIND(\"-\",Y6)-2)-0))","v":5},{"$f":"IF(OR(ISERROR(FIND(\"-\",Z6)),AN6>'export html'!$AR$7),\"\",IF(LEFT(Z6,1)<>\"*\",LEFT(Z6,FIND(\"-\",Z6)-1)-0,MID(Z6,2,FIND(\"-\",Z6)-2)-0))","v":""},{"$f":"IF(OR(ISERROR(FIND(\"-\",AA6)),AO6>'export html'!$AR$7),\"\",IF(LEFT(AA6,1)<>\"*\",LEFT(AA6,FIND(\"-\",AA6)-1)-0,MID(AA6,2,FIND(\"-\",AA6)-2)-0))","v":4},{"$f":"IF(OR(ISERROR(FIND(\"-\",AB6)),AP6>'export html'!$AR$7),\"\",IF(LEFT(AB6,1)<>\"*\",LEFT(AB6,FIND(\"-\",AB6)-1)-0,MID(AB6,2,FIND(\"-\",AB6)-2)-0))","v":""},{"$f":"IF(OR(ISERROR(FIND(\"-\",AC6)),AQ6>'export html'!$AR$7),\"\",IF(LEFT(AC6,1)<>\"*\",LEFT(AC6,FIND(\"-\",AC6)-1)-0,MID(AC6,2,FIND(\"-\",AC6)-2)-0))","v":""},{"$f":"IF(OR(ISERROR(FIND(\"-\",AD6)),AR6>'export html'!$AR$7),\"\",IF(LEFT(AD6,1)<>\"*\",LEFT(AD6,FIND(\"-\",AD6)-1)-0,MID(AD6,2,FIND(\"-\",AD6)-2)-0))","v":""},2,{"$f":"IF(OR(ISERROR(FIND(\"-\",Q6)),AE6<='export html'!$AR$7),\"\",IF(LEFT(Q6,1)<>\"*\",LEFT(Q6,FIND(\"-\",Q6)-1)-0,MID(Q6,2,FIND(\"-\",Q6)-2)-0))","v":""},null,{"$f":"IF(OR(ISERROR(FIND(\"-\",S6)),AG6<='export html'!$AR$7),\"\",IF(LEFT(S6,1)<>\"*\",LEFT(S6,FIND(\"-\",S6)-1)-0,MID(S6,2,FIND(\"-\",S6)-2)-0))","v":""},{"$f":"IF(OR(ISERROR(FIND(\"-\",T6)),AH6<='export html'!$AR$7),\"\",IF(LEFT(T6,1)<>\"*\",LEFT(T6,FIND(\"-\",T6)-1)-0,MID(T6,2,FIND(\"-\",T6)-2)-0))","v":""},{"$f":"IF(OR(ISERROR(FIND(\"-\",U6)),AI6<='export html'!$AR$7),\"\",IF(LEFT(U6,1)<>\"*\",LEFT(U6,FIND(\"-\",U6)-1)-0,MID(U6,2,FIND(\"-\",U6)-2)-0))","v":""},{"$f":"IF(OR(ISERROR(FIND(\"-\",V6)),AJ6<='export html'!$AR$7),\"\",IF(LEFT(V6,1)<>\"*\",LEFT(V6,FIND(\"-\",V6)-1)-0,MID(V6,2,FIND(\"-\",V6)-2)-0))","v":""},{"$f":"IF(OR(ISERROR(FIND(\"-\",W6)),AK6<='export html'!$AR$7),\"\",IF(LEFT(W6,1)<>\"*\",LEFT(W6,FIND(\"-\",W6)-1)-0,MID(W6,2,FIND(\"-\",W6)-2)-0))","v":""},{"$f":"IF(OR(ISERROR(FIND(\"-\",X6)),AL6<='export html'!$AR$7),\"\",IF(LEFT(X6,1)<>\"*\",LEFT(X6,FIND(\"-\",X6)-1)-0,MID(X6,2,FIND(\"-\",X6)-2)-0))","v":""},{"$f":"IF(OR(ISERROR(FIND(\"-\",Y6)),AM6<='export html'!$AR$7),\"\",IF(LEFT(Y6,1)<>\"*\",LEFT(Y6,FIND(\"-\",Y6)-1)-0,MID(Y6,2,FIND(\"-\",Y6)-2)-0))","v":""},{"$f":"IF(OR(ISERROR(FIND(\"-\",Z6)),AN6<='export html'!$AR$7),\"\",IF(LEFT(Z6,1)<>\"*\",LEFT(Z6,FIND(\"-\",Z6)-1)-0,MID(Z6,2,FIND(\"-\",Z6)-2)-0))","v":""},{"$f":"IF(OR(ISERROR(FIND(\"-\",AA6)),AO6<='export html'!$AR$7),\"\",IF(LEFT(AA6,1)<>\"*\",LEFT(AA6,FIND(\"-\",AA6)-1)-0,MID(AA6,2,FIND(\"-\",AA6)-2)-0))","v":""},{"$f":"IF(OR(ISERROR(FIND(\"-\",AB6)),AP6<='export html'!$AR$7),\"\",IF(LEFT(AB6,1)<>\"*\",LEFT(AB6,FIND(\"-\",AB6)-1)-0,MID(AB6,2,FIND(\"-\",AB6)-2)-0))","v":""},{"$f":"IF(OR(ISERROR(FIND(\"-\",AC6)),AQ6<='export html'!$AR$7),\"\",IF(LEFT(AC6,1)<>\"*\",LEFT(AC6,FIND(\"-\",AC6)-1)-0,MID(AC6,2,FIND(\"-\",AC6)-2)-0))","v":""},{"$f":"IF(OR(ISERROR(FIND(\"-\",AD6)),AR6<='export html'!$AR$7),\"\",IF(LEFT(AD6,1)<>\"*\",LEFT(AD6,FIND(\"-\",AD6)-1)-0,MID(AD6,2,FIND(\"-\",AD6)-2)-0))","v":""},2]
[null,null,{"$f":"IF(RANK(E7,$E$5:$E$18,0)>RANK(E6,$E$5:$E$18,0),RANK(E7,$E$5:$E$18,0),\"\")","v":""},{"$f":"VLOOKUP(BT7,HulpberekeningenStand,2,FALSE)","v":"Alberta Schilde"},13,6,{"$f":"REPT(IF(F7-MODE($F$5:$F$18)<0,\"-\",\"+\"),ABS(F7-MODE($F$5:$F$18)))","v":""},{"$f":"VLOOKUP(BT7,HulpberekeningenStand,5,FALSE)","v":4},{"$f":"VLOOKUP(BT7,HulpberekeningenStand,6,FALSE)","v":1},{"$f":"VLOOKUP(BT7,HulpberekeningenStand,7,FALSE)","v":1},{"$f":"VLOOKUP(BT7,HulpberekeningenStand,8,FALSE)","v":21},{"$f":"VLOOKUP(BT7,HulpberekeningenStand,9,FALSE)","v":9},12,5,null,"Bar Patron",null,"4-2",null,null,null,null,null,null,"6-0",null,null,null,null,"4-4",21,4,null,16,25,11,7,23,6,14,18,13,9,2,"2025-02-23","2024-09-22",null,"2025-01-19","2025-03-30","2024-11-17","2024-10-13","2025-03-16","2024-10-06","2024-12-08","2025-02-02","2024-12-01","2024-11-03","2024-09-08",null,{"$f":"RANK( BJ7, $BJ$5:$BJ$18, 0 ) - RANK( BK7, $BK$5:$BK$18, 0 ) / 10^2 + RANK( BL7, $BL$5:$BL$18, 0 ) / 10^4 + RANK( BQ7, $BQ$5:$BQ$18, 0 ) / 10^6 + RANK( BO7, $BO$5:$BO$18, 0 ) / 10^8 + BS7 / 10^10","v":1.9902030303},"Bar Patron",13,6,{"$f":"CHOOSE(StandBer,COUNTIF(BW37:CJ37,\"t\")+COUNTIF(BY35:BY48,\"u\")+COUNTIF(CL37:CY37,\"t\")+COUNTIF(CN35:CN48,\"u\"),COUNTIF(BW37:CJ37,\"t\")+COUNTIF(BY35:BY48,\"u\"),COUNTIF(CL37:CY37,\"t\")+COUNTIF(CN35:CN48,\"u\"),COUNTIF(BW37:CJ37,\"t\")+COUNTIF(CL37:CY37,\"t\"),COUNTIF(BY35:BY48,\"u\")+COUNTIF(CN35:CN48,\"u\"))","v":4},{"$f":"CHOOSE(StandBer,COUNTIF(BW37:CJ37,\"u\")+COUNTIF(BY35:BY48,\"t\")+COUNTIF(CL37:CY37,\"u\")+COUNTIF(CN35:CN48,\"t\"),COUNTIF(BW37:CJ37,\"u\")+COUNTIF(BY35:BY48,\"t\"),COUNTIF(CL37:CY37,\"u\")+COUNTIF(CN35:CN48,\"t\"),COUNTIF(BW37:CJ37,\"u\")+COUNTIF(CL37:CY37,\"u\"),COUNTIF(BY35:BY48,\"t\")+COUNTIF(CN35:CN48,\"t\"))+BR7","v":1},{"$f":"CHOOSE(StandBer,COUNTIF(BW37:CJ37,\"g\")+COUNTIF(BY35:BY48,\"g\")+COUNTIF(CL37:CY37,\"g\")+COUNTIF(CN35:CN48,\"g\"),COUNTIF(BW37:CJ37,\"g\")+COUNTIF(BY35:BY48,\"g\"),COUNTIF(CL37:CY37,\"g\")+COUNTIF(CN35:CN48,\"g\"),COUNTIF(BW37:CJ37,\"g\")+COUNTIF(CL37:CY37,\"g\"),COUNTIF(BY35:BY48,\"g\")+COUNTIF(CN35:CN48,\"g\"))","v":1},{"$f":"CHOOSE(StandBer,SUM(BW7:CJ7)+SUM(BY20:BY33)+SUM(CL7:CY7)+SUM(CN20:CN33),SUM(BW7:CJ7)+SUM(BY20:BY33),SUM(CL7:CY7)+SUM(CN20:CN33),SUM(BW7:CJ7)+SUM(CL7:CY7),SUM(BY20:BY33)+SUM(CN20:CN33))-5*BR7","v":25},{"$f":"CHOOSE(StandBer,SUM(BY5:BY18)+SUM(BW22:CJ22)+SUM(CN5:CN18)+SUM(CL22:CY22),SUM(BY5:BY18)+SUM(BW22:CJ22),SUM(CN5:CN18)+SUM(CL22:CY22),SUM(BY5:BY18)+SUM(CN5:CN18),SUM(BW22:CJ22)+SUM(CL22:CY22))","v":13},12,{"$f":"CHOOSE(StandBer,COUNTIF(BW37:CJ37,\"ff\")+COUNTIF(BY35:BY48,\"ff\")+COUNTIF(CL37:CY37,\"ff\")+COUNTIF(CN35:CN48,\"ff\"),COUNTIF(BW37:CJ37,\"ff\")+COUNTIF(BY35:BY48,\"ff\"),COUNTIF(CL37:CY37,\"ff\")+COUNTIF(CN35:CN48,\"ff\"),COUNTIF(BW37:CJ37,\"ff\")+COUNTIF(CL37:CY37,\"ff\"),COUNTIF(BY35:BY48,\"ff\")+COUNTIF(CN35:CN48,\"ff\"))","v":0},3,{"$f":"SMALL( $BH$5:$BH$18, BS7 )","v":1.9902030500999999},null,3,{"$f":"IF(OR(ISERROR(FIND(\"-\",Q7)),AE7>'export html'!$AR$7),\"\",IF(LEFT(Q7,1)<>\"*\",LEFT(Q7,FIND(\"-\",Q7)-1)-0,MID(Q7,2,FIND(\"-\",Q7)-2)-0))","v":""},{"$f":"IF(OR(ISERROR(FIND(\"-\",R7)),AF7>'export html'!$AR$7),\"\",IF(LEFT(R7,1)<>\"*\",LEFT(R7,FIND(\"-\",R7)-1)-0,MID(R7,2,FIND(\"-\",R7)-2)-0))","v":4},null,{"$f":"IF(OR(ISERROR(FIND(\"-\",T7)),AH7>'export html'!$AR$7),\"\",IF(LEFT(T7,1)<>\"*\",LEFT(T7,FIND(\"-\",T7)-1)-0,MID(T7,2,FIND(\"-\",T7)-2)-0))","v":""},{"$f":"IF(OR(ISERROR(FIND(\"-\",U7)),AI7>'export html'!$AR$7),\"\",IF(LEFT(U7,1)<>\"*\",LEFT(U7,FIND(\"-\",U7)-1)-0,MID(U7,2,FIND(\"-\",U7)-2)-0))","v":""},{"$f":"IF(OR(ISERROR(FIND(\"-\",V7)),AJ7>'export html'!$AR$7),\"\",IF(LEFT(V7,1)<>\"*\",LEFT(V7,FIND(\"-\",V7)-1)-0,MID(V7,2,FIND(\"-\",V7)-2)-0))","v":""},{"$f":"IF(OR(ISERROR(FIND(\"-\",W7)),AK7>'export html'!$AR$7),\"\",IF(LEFT(W7,1)<>\"*\",LEFT(W7,FIND(\"-\",W7)-1)-0,MID(W7,2,FIND(\"-\",W7)-2)-0))","v":""},{"$f":"IF(OR(ISERROR(FIND(\"-\",X7)),AL7>'export html'!$AR$7),\"\",IF(LEFT(X7,1)<>\"*\",LEFT(X7,FIND(\"-\",X7)-1)-0,MID(X7,2,FIND(\"-\",X7)-2)-0))","v":""},{"$f":"IF(OR(ISERROR(FIND(\"-\",Y7)),AM7>'export html'!$AR$7),\"\",IF(LEFT(Y7,1)<>\"*\",LEFT(Y7,FIND(\"-\",Y7)-1)-0,MID(Y7,2,FIND(\"-\",Y7)-2)-0))","v":6},{"$f":"IF(OR(ISERROR(FIND(\"-\",Z7)),AN7>'export html'!$AR$7),\"\",IF(LEFT(Z7,1)<>\"*\",LEFT(Z7,FIND(\"-\",Z7)-1)-0,MID(Z7,2,FIND(\"-\",Z7)-2)-0))","v":""},{"$f":"IF(OR(ISERROR(FIND(\"-\",AA7)),AO7>'export html'!$AR$7),\"\",IF(LEFT(AA7,1)<>\"*\",LEFT(AA7,FIND(\"-\",AA7)-1)-0,MID(AA7,2,FIND(\"-\",AA7)-2)-0))","v":""},{"$f":"IF(OR(ISERROR(FIND(\"-\",AB7)),AP7>'export html'!$AR$7),\"\",IF(LEFT(AB7,1)<>\"*\",LEFT(AB7,FIND(\"-\",AB7)-1)-0,MID(AB7,2,FIND(\"-\",AB7)-2)-0))","v":""},{"$f":"IF(OR(ISERROR(FIND(\"-\",AC7)),AQ7>'export html'!$AR$7),\"\",IF(LEFT(AC7,1)<>\"*\",LEFT(AC7,FIND(\"-\",AC7)-1)-0,MID(AC7,2,FIND(\"-\",AC7)-2)-0))","v":""},{"$f":"IF(OR(ISERROR(FIND(\"-\",AD7)),AR7>'export html'!$AR$7),\"\",IF(LEFT(AD7,1)<>\"*\",LEFT(AD7,FIND(\"-\",AD7)-1)-0,MID(AD7,2,FIND(\"-\",AD7)-2)-0))","v":4},3,{"$f":"IF(OR(ISERROR(FIND(\"-\",Q7)),AE7<='export html'!$AR$7),\"\",IF(LEFT(Q7,1)<>\"*\",LEFT(Q7,FIND(\"-\",Q7)-1)-0,MID(Q7,2,FIND(\"-\",Q7)-2)-0))","v":""},{"$f":"IF(OR(ISERROR(FIND(\"-\",R7)),AF7<='export html'!$AR$7),\"\",IF(LEFT(R7,1)<>\"*\",LEFT(R7,FIND(\"-\",R7)-1)-0,MID(R7,2,FIND(\"-\",R7)-2)-0))","v":""},null,{"$f":"IF(OR(ISERROR(FIND(\"-\",T7)),AH7<='export html'!$AR$7),\"\",IF(LEFT(T7,1)<>\"*\",LEFT(T7,FIND(\"-\",T7)-1)-0,MID(T7,2,FIND(\"-\",T7)-2)-0))","v":""},{"$f":"IF(OR(ISERROR(FIND(\"-\",U7)),AI7<='export html'!$AR$7),\"\",IF(LEFT(U7,1)<>\"*\",LEFT(U7,FIND(\"-\",U7)-1)-0,MID(U7,2,FIND(\"-\",U7)-2)-0))","v":""},{"$f":"IF(OR(ISERROR(FIND(\"-\",V7)),AJ7<='export html'!$AR$7),\"\",IF(LEFT(V7,1)<>\"*\",LEFT(V7,FIND(\"-\",V7)-1)-0,MID(V7,2,FIND(\"-\",V7)-2)-0))","v":""},{"$f":"IF(OR(ISERROR(FIND(\"-\",W7)),AK7<='export html'!$AR$7),\"\",IF(LEFT(W7,1)<>\"*\",LEFT(W7,FIND(\"-\",W7)-1)-0,MID(W7,2,FIND(\"-\",W7)-2)-0))","v":""},{"$f":"IF(OR(ISERROR(FIND(\"-\",X7)),AL7<='export html'!$AR$7),\"\",IF(LEFT(X7,1)<>\"*\",LEFT(X7,FIND(\"-\",X7)-1)-0,MID(X7,2,FIND(\"-\",X7)-2)-0))","v":""},{"$f":"IF(OR(ISERROR(FIND(\"-\",Y7)),AM7<='export html'!$AR$7),\"\",IF(LEFT(Y7,1)<>\"*\",LEFT(Y7,FIND(\"-\",Y7)-1)-0,MID(Y7,2,FIND(\"-\",Y7)-2)-0))","v":""},{"$f":"IF(OR(ISERROR(FIND(\"-\",Z7)),AN7<='export html'!$AR$7),\"\",IF(LEFT(Z7,1)<>\"*\",LEFT(Z7,FIND(\"-\",Z7)-1)-0,MID(Z7,2,FIND(\"-\",Z7)-2)-0))","v":""},{"$f":"IF(OR(ISERROR(FIND(\"-\",AA7)),AO7<='export html'!$AR$7),\"\",IF(LEFT(AA7,1)<>\"*\",LEFT(AA7,FIND(\"-\",AA7)-1)-0,MID(AA7,2,FIND(\"-\",AA7)-2)-0))","v":""},{"$f":"IF(OR(ISERROR(FIND(\"-\",AB7)),AP7<='export html'!$AR$7),\"\",IF(LEFT(AB7,1)<>\"*\",LEFT(AB7,FIND(\"-\",AB7)-1)-0,MID(AB7,2,FIND(\"-\",AB7)-2)-0))","v":""},{"$f":"IF(OR(ISERROR(FIND(\"-\",AC7)),AQ7<='export html'!$AR$7),\"\",IF(LEFT(AC7,1)<>\"*\",LEFT(AC7,FIND(\"-\",AC7)-1)-0,MID(AC7,2,FIND(\"-\",AC7)-2)-0))","v":""},{"$f":"IF(OR(ISERROR(FIND(\"-\",AD7)),AR7<='export html'!$AR$7),\"\",IF(LEFT(AD7,1)<>\"*\",LEFT(AD7,FIND(\"-\",AD7)-1)-0,MID(AD7,2,FIND(\"-\",AD7)-2)-0))","v":""},3]
[null,null,4,{"$f":"VLOOKUP(BT8,HulpberekeningenStand,2,FALSE)","v":"Sint Anneke"},{"$f":"3*H8+J8","v":12},{"$f":"SUM(H8:J8)","v":6},{"$f":"REPT(IF(F8-MODE($F$5:$F$18)<0,\"-\",\"+\"),ABS(F8-MODE($F$5:$F$18)))","v":""},{"$f":"VLOOKUP(BT8,HulpberekeningenStand,5,FALSE)","v":4},{"$f":"VLOOKUP(BT8,HulpberekeningenStand,6,FALSE)","v":2},{"$f":"VLOOKUP(BT8,HulpberekeningenStand,7,FALSE)","v":0},{"$f":"VLOOKUP(BT8,HulpberekeningenStand,8,FALSE)","v":29},{"$f":"VLOOKUP(BT8,HulpberekeningenStand,9,FALSE)","v":20},{"$f":"K8-L8","v":9},{"$f":"3*F8-E8","v":6},null,"Bariton","4-1","2-7","3-7",null,null,null,null,null,null,null,null,null,null,null,5,1,3,null,9,21,17,7,13,11,15,23,19,25,"2024-09-29","2024-09-01","2024-09-15",null,"2024-11-03","2025-02-23","2025-01-26","2024-10-13","2024-12-01","2024-11-17","2025-01-12","2025-03-16","2025-02-09","2025-03-30",null,{"$f":"RANK( BJ8, $BJ$5:$BJ$18, 0 ) - RANK( BK8, $BK$5:$BK$18, 0 ) / 10^2 + RANK( BL8, $BL$5:$BL$18, 0 ) / 10^4 + RANK( BQ8, $BQ$5:$BQ$18, 0 ) / 10^6 + RANK( BO8, $BO$5:$BO$18, 0 ) / 10^8 + BS8 / 10^10","v":7.9908080904000007},"Bariton",7,6,{"$f":"CHOOSE(StandBer,COUNTIF(BW38:CJ38,\"t\")+COUNTIF(BZ35:BZ48,\"u\")+COUNTIF(CL38:CY38,\"t\")+COUNTIF(CO35:CO48,\"u\"),COUNTIF(BW38:CJ38,\"t\")+COUNTIF(BZ35:BZ48,\"u\"),COUNTIF(CL38:CY38,\"t\")+COUNTIF(CO35:CO48,\"u\"),COUNTIF(BW38:CJ38,\"t\")+COUNTIF(CL38:CY38,\"t\"),COUNTIF(BZ35:BZ48,\"u\")+COUNTIF(CO35:CO48,\"u\"))","v":2},{"$f":"CHOOSE(StandBer,COUNTIF(BW38:CJ38,\"u\")+COUNTIF(BZ35:BZ48,\"t\")+COUNTIF(CL38:CY38,\"u\")+COUNTIF(CO35:CO48,\"t\"),COUNTIF(BW38:CJ38,\"u\")+COUNTIF(BZ35:BZ48,\"t\"),COUNTIF(CL38:CY38,\"u\")+COUNTIF(CO35:CO48,\"t\"),COUNTIF(BW38:CJ38,\"u\")+COUNTIF(CL38:CY38,\"u\"),COUNTIF(BZ35:BZ48,\"t\")+COUNTIF(CO35:CO48,\"t\"))+BR8","v":3},{"$f":"CHOOSE(StandBer,COUNTIF(BW38:CJ38,\"g\")+COUNTIF(BZ35:BZ48,\"g\")+COUNTIF(CL38:CY38,\"g\")+COUNTIF(CO35:CO48,\"g\"),COUNTIF(BW38:CJ38,\"g\")+COUNTIF(BZ35:BZ48,\"g\"),COUNTIF(CL38:CY38,\"g\")+COUNTIF(CO35:CO48,\"g\"),COUNTIF(BW38:CJ38,\"g\")+COUNTIF(CL38:CY38,\"g\"),COUNTIF(BZ35:BZ48,\"g\")+COUNTIF(CO35:CO48,\"g\"))","v":1},{"$f":"CHOOSE(StandBer,SUM(BW8:CJ8)+SUM(BZ20:BZ33)+SUM(CL8:CY8)+SUM(CO20:CO33),SUM(BW8:CJ8)+SUM(BZ20:BZ33),SUM(CL8:CY8)+SUM(CO20:CO33),SUM(BW8:CJ8)+SUM(CL8:CY8),SUM(BZ20:BZ33)+SUM(CO20:CO33))-5*BR8","v":16},{"$f":"CHOOSE(StandBer,SUM(BZ5:BZ18)+SUM(BW23:CJ23)+SUM(CO5:CO18)+SUM(CL23:CY23),SUM(BZ5:BZ18)+SUM(BW23:CJ23),SUM(CO5:CO18)+SUM(CL23:CY23),SUM(BZ5:BZ18)+SUM(CO5:CO18),SUM(BW23:CJ23)+SUM(CL23:CY23))","v":19},-3,{"$f":"CHOOSE(StandBer,COUNTIF(BW38:CJ38,\"ff\")+COUNTIF(BZ35:BZ48,\"ff\")+COUNTIF(CL38:CY38,\"ff\")+COUNTIF(CO35:CO48,\"ff\"),COUNTIF(BW38:CJ38,\"ff\")+COUNTIF(BZ35:BZ48,\"ff\"),COUNTIF(CL38:CY38,\"ff\")+COUNTIF(CO35:CO48,\"ff\"),COUNTIF(BW38:CJ38,\"ff\")+COUNTIF(CL38:CY38,\"ff\"),COUNTIF(BZ35:BZ48,\"ff\")+COUNTIF(CO35:CO48,\"ff\"))","v":0},4,{"$f":"SMALL( $BH$5:$BH$18, BS8 )","v":3.9902050112},null,4,{"$f":"IF(OR(ISERROR(FIND(\"-\",Q8)),AE8>'export html'!$AR$7),\"\",IF(LEFT(Q8,1)<>\"*\",LEFT(Q8,FIND(\"-\",Q8)-1)-0,MID(Q8,2,FIND(\"-\",Q8)-2)-0))","v":4},{"$f":"IF(OR(ISERROR(FIND(\"-\",R8)),AF8>'export html'!$AR$7),\"\",IF(LEFT(R8,1)<>\"*\",LEFT(R8,FIND(\"-\",R8)-1)-0,MID(R8,2,FIND(\"-\",R8)-2)-0))","v":2},{"$f":"IF(OR(ISERROR(FIND(\"-\",S8)),AG8>'export html'!$AR$7),\"\",IF(LEFT(S8,1)<>\"*\",LEFT(S8,FIND(\"-\",S8)-1)-0,MID(S8,2,FIND(\"-\",S8)-2)-0))","v":3},null,{"$f":"IF(OR(ISERROR(FIND(\"-\",U8)),AI8>'export html'!$AR$7),\"\",IF(LEFT(U8,1)<>\"*\",LEFT(U8,FIND(\"-\",U8)-1)-0,MID(U8,2,FIND(\"-\",U8)-2)-0))","v":""},{"$f":"IF(OR(ISERROR(FIND(\"-\",V8)),AJ8>'export html'!$AR$7),\"\",IF(LEFT(V8,1)<>\"*\",LEFT(V8,FIND(\"-\",V8)-1)-0,MID(V8,2,FIND(\"-\",V8)-2)-0))","v":""},{"$f":"IF(OR(ISERROR(FIND(\"-\",W8)),AK8>'export html'!$AR$7),\"\",IF(LEFT(W8,1)<>\"*\",LEFT(W8,FIND(\"-\",W8)-1)-0,MID(W8,2,FIND(\"-\",W8)-2)-0))","v":""},{"$f":"IF(OR(ISERROR(FIND(\"-\",X8)),AL8>'export html'!$AR$7),\"\",IF(LEFT(X8,1)<>\"*\",LEFT(X8,FIND(\"-\",X8)-1)-0,MID(X8,2,FIND(\"-\",X8)-2)-0))","v":""},{"$f":"IF(OR(ISERROR(FIND(\"-\",Y8)),AM8>'export html'!$AR$7),\"\",IF(LEFT(Y8,1)<>\"*\",LEFT(Y8,FIND(\"-\",Y8)-1)-0,MID(Y8,2,FIND(\"-\",Y8)-2)-0))","v":""},{"$f":"IF(OR(ISERROR(FIND(\"-\",Z8)),AN8>'export html'!$AR$7),\"\",IF(LEFT(Z8,1)<>\"*\",LEFT(Z8,FIND(\"-\",Z8)-1)-0,MID(Z8,2,FIND(\"-\",Z8)-2)-0))","v":""},{"$f":"IF(OR(ISERROR(FIND(\"-\",AA8)),AO8>'export html'!$AR$7),\"\",IF(LEFT(AA8,1)<>\"*\",LEFT(AA8,FIND(\"-\",AA8)-1)-0,MID(AA8,2,FIND(\"-\",AA8)-2)-0))","v":""},{"$f":"IF(OR(ISERROR(FIND(\"-\",AB8)),AP8>'export html'!$AR$7),\"\",IF(LEFT(AB8,1)<>\"*\",LEFT(AB8,FIND(\"-\",AB8)-1)-0,MID(AB8,2,FIND(\"-\",AB8)-2)-0))","v":""},{"$f":"IF(OR(ISERROR(FIND(\"-\",AC8)),AQ8>'export html'!$AR$7),\"\",IF(LEFT(AC8,1)<>\"*\",LEFT(AC8,FIND(\"-\",AC8)-1)-0,MID(AC8,2,FIND(\"-\",AC8)-2)-0))","v":""},{"$f":"IF(OR(ISERROR(FIND(\"-\",AD8)),AR8>'export html'!$AR$7),\"\",IF(LEFT(AD8,1)<>\"*\",LEFT(AD8,FIND(\"-\",AD8)-1)-0,MID(AD8,2,FIND(\"-\",AD8)-2)-0))","v":""},4,{"$f":"IF(OR(ISERROR(FIND(\"-\",Q8)),AE8<='export html'!$AR$7),\"\",IF(LEFT(Q8,1)<>\"*\",LEFT(Q8,FIND(\"-\",Q8)-1)-0,MID(Q8,2,FIND(\"-\",Q8)-2)-0))","v":""},{"$f":"IF(OR(ISERROR(FIND(\"-\",R8)),AF8<='export html'!$AR$7),\"\",IF(LEFT(R8,1)<>\"*\",LEFT(R8,FIND(\"-\",R8)-1)-0,MID(R8,2,FIND(\"-\",R8)-2)-0))","v":""},{"$f":"IF(OR(ISERROR(FIND(\"-\",S8)),AG8<='export html'!$AR$7),\"\",IF(LEFT(S8,1)<>\"*\",LEFT(S8,FIND(\"-\",S8)-1)-0,MID(S8,2,FIND(\"-\",S8)-2)-0))","v":""},null,{"$f":"IF(OR(ISERROR(FIND(\"-\",U8)),AI8<='export html'!$AR$7),\"\",IF(LEFT(U8,1)<>\"*\",LEFT(U8,FIND(\"-\",U8)-1)-0,MID(U8,2,FIND(\"-\",U8)-2)-0))","v":""},{"$f":"IF(OR(ISERROR(FIND(\"-\",V8)),AJ8<='export html'!$AR$7),\"\",IF(LEFT(V8,1)<>\"*\",LEFT(V8,FIND(\"-\",V8)-1)-0,MID(V8,2,FIND(\"-\",V8)-2)-0))","v":""},{"$f":"IF(OR(ISERROR(FIND(\"-\",W8)),AK8<='export html'!$AR$7),\"\",IF(LEFT(W8,1)<>\"*\",LEFT(W8,FIND(\"-\",W8)-1)-0,MID(W8,2,FIND(\"-\",W8)-2)-0))","v":""},{"$f":"IF(OR(ISERROR(FIND(\"-\",X8)),AL8<='export html'!$AR$7),\"\",IF(LEFT(X8,1)<>\"*\",LEFT(X8,FIND(\"-\",X8)-1)-0,MID(X8,2,FIND(\"-\",X8)-2)-0))","v":""},{"$f":"IF(OR(ISERROR(FIND(\"-\",Y8)),AM8<='export html'!$AR$7),\"\",IF(LEFT(Y8,1)<>\"*\",LEFT(Y8,FIND(\"-\",Y8)-1)-0,MID(Y8,2,FIND(\"-\",Y8)-2)-0))","v":""},{"$f":"IF(OR(ISERROR(FIND(\"-\",Z8)),AN8<='export html'!$AR$7),\"\",IF(LEFT(Z8,1)<>\"*\",LEFT(Z8,FIND(\"-\",Z8)-1)-0,MID(Z8,2,FIND(\"-\",Z8)-2)-0))","v":""},{"$f":"IF(OR(ISERROR(FIND(\"-\",AA8)),AO8<='export html'!$AR$7),\"\",IF(LEFT(AA8,1)<>\"*\",LEFT(AA8,FIND(\"-\",AA8)-1)-0,MID(AA8,2,FIND(\"-\",AA8)-2)-0))","v":""},{"$f":"IF(OR(ISERROR(FIND(\"-\",AB8)),AP8<='export html'!$AR$7),\"\",IF(LEFT(AB8,1)<>\"*\",LEFT(AB8,FIND(\"-\",AB8)-1)-0,MID(AB8,2,FIND(\"-\",AB8)-2)-0))","v":""},{"$f":"IF(OR(ISERROR(FIND(\"-\",AC8)),AQ8<='export html'!$AR$7),\"\",IF(LEFT(AC8,1)<>\"*\",LEFT(AC8,FIND(\"-\",AC8)-1)-0,MID(AC8,2,FIND(\"-\",AC8)-2)-0))","v":""},{"$f":"IF(OR(ISERROR(FIND(\"-\",AD8)),AR8<='export html'!$AR$7),\"\",IF(LEFT(AD8,1)<>\"*\",LEFT(AD8,FIND(\"-\",AD8)-1)-0,MID(AD8,2,FIND(\"-\",AD8)-2)-0))","v":""},4]
[null,null,"","Antwerp Global",12,6,{"$f":"REPT(IF(F9-MODE($F$5:$F$18)<0,\"-\",\"+\"),ABS(F9-MODE($F$5:$F$18)))","v":""},4,2,0,21,12,9,6,null,"Corum","2-3",null,null,null,null,null,null,"4-5",null,null,null,"2-10",null,null,1,10,12,22,null,17,26,3,18,20,24,6,15,8,"2024-09-01","2024-11-10","2024-11-24","2025-03-09",null,"2025-01-26","2025-04-06","2024-09-15","2025-02-02","2025-02-16","2025-03-23","2024-10-06","2025-01-12","2024-10-20",null,{"$f":"RANK( BJ9, $BJ$5:$BJ$18, 0 ) - RANK( BK9, $BK$5:$BK$18, 0 ) / 10^2 + RANK( BL9, $BL$5:$BL$18, 0 ) / 10^4 + RANK( BQ9, $BQ$5:$BQ$18, 0 ) / 10^6 + RANK( BO9, $BO$5:$BO$18, 0 ) / 10^8 + BS9 / 10^10","v":11.9911100705},"Corum",4,6,{"$f":"CHOOSE(StandBer,COUNTIF(BW39:CJ39,\"t\")+COUNTIF(CA35:CA48,\"u\")+COUNTIF(CL39:CY39,\"t\")+COUNTIF(CP35:CP48,\"u\"),COUNTIF(BW39:CJ39,\"t\")+COUNTIF(CA35:CA48,\"u\"),COUNTIF(CL39:CY39,\"t\")+COUNTIF(CP35:CP48,\"u\"),COUNTIF(BW39:CJ39,\"t\")+COUNTIF(CL39:CY39,\"t\"),COUNTIF(CA35:CA48,\"u\")+COUNTIF(CP35:CP48,\"u\"))","v":1},{"$f":"CHOOSE(StandBer,COUNTIF(BW39:CJ39,\"u\")+COUNTIF(CA35:CA48,\"t\")+COUNTIF(CL39:CY39,\"u\")+COUNTIF(CP35:CP48,\"t\"),COUNTIF(BW39:CJ39,\"u\")+COUNTIF(CA35:CA48,\"t\"),COUNTIF(CL39:CY39,\"u\")+COUNTIF(CP35:CP48,\"t\"),COUNTIF(BW39:CJ39,\"u\")+COUNTIF(CL39:CY39,\"u\"),COUNTIF(CA35:CA48,\"t\")+COUNTIF(CP35:CP48,\"t\"))+BR9","v":4},{"$f":"CHOOSE(StandBer,COUNTIF(BW39:CJ39,\"g\")+COUNTIF(CA35:CA48,\"g\")+COUNTIF(CL39:CY39,\"g\")+COUNTIF(CP35:CP48,\"g\"),COUNTIF(BW39:CJ39,\"g\")+COUNTIF(CA35:CA48,\"g\"),COUNTIF(CL39:CY39,\"g\")+COUNTIF(CP35:CP48,\"g\"),COUNTIF(BW39:CJ39,\"g\")+COUNTIF(CL39:CY39,\"g\"),COUNTIF(CA35:CA48,\"g\")+COUNTIF(CP35:CP48,\"g\"))","v":1},{"$f":"CHOOSE(StandBer,SUM(BW9:CJ9)+SUM(CA20:CA33)+SUM(CL9:CY9)+SUM(CP20:CP33),SUM(BW9:CJ9)+SUM(CA20:CA33),SUM(CL9:CY9)+SUM(CP20:CP33),SUM(BW9:CJ9)+SUM(CL9:CY9),SUM(CA20:CA33)+SUM(CP20:CP33))-5*BR9","v":20},{"$f":"CHOOSE(StandBer,SUM(CA5:CA18)+SUM(BW24:CJ24)+SUM(CP5:CP18)+SUM(CL24:CY24),SUM(CA5:CA18)+SUM(BW24:CJ24),SUM(CP5:CP18)+SUM(CL24:CY24),SUM(CA5:CA18)+SUM(CP5:CP18),SUM(BW24:CJ24)+SUM(CL24:CY24))","v":26},-6,{"$f":"CHOOSE(StandBer,COUNTIF(BW39:CJ39,\"ff\")+COUNTIF(CA35:CA48,\"ff\")+COUNTIF(CL39:CY39,\"ff\")+COUNTIF(CP35:CP48,\"ff\"),COUNTIF(BW39:CJ39,\"ff\")+COUNTIF(CA35:CA48,\"ff\"),COUNTIF(CL39:CY39,\"ff\")+COUNTIF(CP35:CP48,\"ff\"),COUNTIF(BW39:CJ39,\"ff\")+COUNTIF(CL39:CY39,\"ff\"),COUNTIF(CA35:CA48,\"ff\")+COUNTIF(CP35:CP48,\"ff\"))","v":0},5,{"$f":"SMALL( $BH$5:$BH$18, BS9 )","v":3.9902050502000002},null,5,{"$f":"IF(OR(ISERROR(FIND(\"-\",Q9)),AE9>'export html'!$AR$7),\"\",IF(LEFT(Q9,1)<>\"*\",LEFT(Q9,FIND(\"-\",Q9)-1)-0,MID(Q9,2,FIND(\"-\",Q9)-2)-0))","v":2},{"$f":"IF(OR(ISERROR(FIND(\"-\",R9)),AF9>'export html'!$AR$7),\"\",IF(LEFT(R9,1)<>\"*\",LEFT(R9,FIND(\"-\",R9)-1)-0,MID(R9,2,FIND(\"-\",R9)-2)-0))","v":""},{"$f":"IF(OR(ISERROR(FIND(\"-\",S9)),AG9>'export html'!$AR$7),\"\",IF(LEFT(S9,1)<>\"*\",LEFT(S9,FIND(\"-\",S9)-1)-0,MID(S9,2,FIND(\"-\",S9)-2)-0))","v":""},{"$f":"IF(OR(ISERROR(FIND(\"-\",T9)),AH9>'export html'!$AR$7),\"\",IF(LEFT(T9,1)<>\"*\",LEFT(T9,FIND(\"-\",T9)-1)-0,MID(T9,2,FIND(\"-\",T9)-2)-0))","v":""},null,{"$f":"IF(OR(ISERROR(FIND(\"-\",V9)),AJ9>'export html'!$AR$7),\"\",IF(LEFT(V9,1)<>\"*\",LEFT(V9,FIND(\"-\",V9)-1)-0,MID(V9,2,FIND(\"-\",V9)-2)-0))","v":""},{"$f":"IF(OR(ISERROR(FIND(\"-\",W9)),AK9>'export html'!$AR$7),\"\",IF(LEFT(W9,1)<>\"*\",LEFT(W9,FIND(\"-\",W9)-1)-0,MID(W9,2,FIND(\"-\",W9)-2)-0))","v":""},{"$f":"IF(OR(ISERROR(FIND(\"-\",X9)),AL9>'export html'!$AR$7),\"\",IF(LEFT(X9,1)<>\"*\",LEFT(X9,FIND(\"-\",X9)-1)-0,MID(X9,2,FIND(\"-\",X9)-2)-0))","v":4},{"$f":"IF(OR(ISERROR(FIND(\"-\",Y9)),AM9>'export html'!$AR$7),\"\",IF(LEFT(Y9,1)<>\"*\",LEFT(Y9,FIND(\"-\",Y9)-1)-0,MID(Y9,2,FIND(\"-\",Y9)-2)-0))","v":""},{"$f":"IF(OR(ISERROR(FIND(\"-\",Z9)),AN9>'export html'!$AR$7),\"\",IF(LEFT(Z9,1)<>\"*\",LEFT(Z9,FIND(\"-\",Z9)-1)-0,MID(Z9,2,FIND(\"-\",Z9)-2)-0))","v":""},{"$f":"IF(OR(ISERROR(FIND(\"-\",AA9)),AO9>'export html'!$AR$7),\"\",IF(LEFT(AA9,1)<>\"*\",LEFT(AA9,FIND(\"-\",AA9)-1)-0,MID(AA9,2,FIND(\"-\",AA9)-2)-0))","v":""},{"$f":"IF(OR(ISERROR(FIND(\"-\",AB9)),AP9>'export html'!$AR$7),\"\",IF(LEFT(AB9,1)<>\"*\",LEFT(AB9,FIND(\"-\",AB9)-1)-0,MID(AB9,2,FIND(\"-\",AB9)-2)-0))","v":2},{"$f":"IF(OR(ISERROR(FIND(\"-\",AC9)),AQ9>'export html'!$AR$7),\"\",IF(LEFT(AC9,1)<>\"*\",LEFT(AC9,FIND(\"-\",AC9)-1)-0,MID(AC9,2,FIND(\"-\",AC9)-2)-0))","v":""},{"$f":"IF(OR(ISERROR(FIND(\"-\",AD9)),AR9>'export html'!$AR$7),\"\",IF(LEFT(AD9,1)<>\"*\",LEFT(AD9,FIND(\"-\",AD9)-1)-0,MID(AD9,2,FIND(\"-\",AD9)-2)-0))","v":""},5,{"$f":"IF(OR(ISERROR(FIND(\"-\",Q9)),AE9<='export html'!$AR$7),\"\",IF(LEFT(Q9,1)<>\"*\",LEFT(Q9,FIND(\"-\",Q9)-1)-0,MID(Q9,2,FIND(\"-\",Q9)-2)-0))","v":""},{"$f":"IF(OR(ISERROR(FIND(\"-\",R9)),AF9<='export html'!$AR$7),\"\",IF(LEFT(R9,1)<>\"*\",LEFT(R9,FIND(\"-\",R9)-1)-0,MID(R9,2,FIND(\"-\",R9)-2)-0))","v":""},{"$f":"IF(OR(ISERROR(FIND(\"-\",S9)),AG9<='export html'!$AR$7),\"\",IF(LEFT(S9,1)<>\"*\",LEFT(S9,FIND(\"-\",S9)-1)-0,MID(S9,2,FIND(\"-\",S9)-2)-0))","v":""},{"$f":"IF(OR(ISERROR(FIND(\"-\",T9)),AH9<='export html'!$AR$7),\"\",IF(LEFT(T9,1)<>\"*\",LEFT(T9,FIND(\"-\",T9)-1)-0,MID(T9,2,FIND(\"-\",T9)-2)-0))","v":""},null,{"$f":"IF(OR(ISERROR(FIND(\"-\",V9)),AJ9<='export html'!$AR$7),\"\",IF(LEFT(V9,1)<>\"*\",LEFT(V9,FIND(\"-\",V9)-1)-0,MID(V9,2,FIND(\"-\",V9)-2)-0))","v":""},{"$f":"IF(OR(ISERROR(FIND(\"-\",W9)),AK9<='export html'!$AR$7),\"\",IF(LEFT(W9,1)<>\"*\",LEFT(W9,FIND(\"-\",W9)-1)-0,MID(W9,2,FIND(\"-\",W9)-2)-0))","v":""},{"$f":"IF(OR(ISERROR(FIND(\"-\",X9)),AL9<='export html'!$AR$7),\"\",IF(LEFT(X9,1)<>\"*\",LEFT(X9,FIND(\"-\",X9)-1)-0,MID(X9,2,FIND(\"-\",X9)-2)-0))","v":""},{"$f":"IF(OR(ISERROR(FIND(\"-\",Y9)),AM9<='export html'!$AR$7),\"\",IF(LEFT(Y9,1)<>\"*\",LEFT(Y9,FIND(\"-\",Y9)-1)-0,MID(Y9,2,FIND(\"-\",Y9)-2)-0))","v":""},{"$f":"IF(OR(ISERROR(FIND(\"-\",Z9)),AN9<='export html'!$AR$7),\"\",IF(LEFT(Z9,1)<>\"*\",LEFT(Z9,FIND(\"-\",Z9)-1)-0,MID(Z9,2,FIND(\"-\",Z9)-2)-0))","v":""},{"$f":"IF(OR(ISERROR(FIND(\"-\",AA9)),AO9<='export html'!$AR$7),\"\",IF(LEFT(AA9,1)<>\"*\",LEFT(AA9,FIND(\"-\",AA9)-1)-0,MID(AA9,2,FIND(\"-\",AA9)-2)-0))","v":""},{"$f":"IF(OR(ISERROR(FIND(\"-\",AB9)),AP9<='export html'!$AR$7),\"\",IF(LEFT(AB9,1)<>\"*\",LEFT(AB9,FIND(\"-\",AB9)-1)-0,MID(AB9,2,FIND(\"-\",AB9)-2)-0))","v":""},{"$f":"IF(OR(ISERROR(FIND(\"-\",AC9)),AQ9<='export html'!$AR$7),\"\",IF(LEFT(AC9,1)<>\"*\",LEFT(AC9,FIND(\"-\",AC9)-1)-0,MID(AC9,2,FIND(\"-\",AC9)-2)-0))","v":""},{"$f":"IF(OR(ISERROR(FIND(\"-\",AD9)),AR9<='export html'!$AR$7),\"\",IF(LEFT(AD9,1)<>\"*\",LEFT(AD9,FIND(\"-\",AD9)-1)-0,MID(AD9,2,FIND(\"-\",AD9)-2)-0))","v":""},5]
[null,null,"",{"$f":"VLOOKUP(BT10,HulpberekeningenStand,2,FALSE)","v":"Yerevan United"},{"$f":"3*H10+J10","v":12},{"$f":"SUM(H10:J10)","v":6},{"$f":"REPT(IF(F10-MODE($F$5:$F$18)<0,\"-\",\"+\"),ABS(F10-MODE($F$5:$F$18)))","v":""},{"$f":"VLOOKUP(BT10,HulpberekeningenStand,5,FALSE)","v":3},{"$f":"VLOOKUP(BT10,HulpberekeningenStand,6,FALSE)","v":0},{"$f":"VLOOKUP(BT10,HulpberekeningenStand,7,FALSE)","v":3},{"$f":"VLOOKUP(BT10,HulpberekeningenStand,8,FALSE)","v":28},{"$f":"VLOOKUP(BT10,HulpberekeningenStand,9,FALSE)","v":13},{"$f":"K10-L10","v":15},{"$f":"3*F10-E10","v":6},null,"Daltons",null,null,null,null,"4-1",null,null,null,null,"3-0",null,null,"4-1",null,26,22,24,8,4,null,12,15,16,6,10,18,1,20,"2025-04-06","2025-03-09","2025-03-23","2024-10-20","2024-09-22",null,"2024-11-24","2025-01-12","2025-01-19","2024-10-06","2024-11-10","2025-02-02","2024-09-01","2025-02-16",null,{"$f":"RANK( BJ10, $BJ$5:$BJ$18, 0 ) - RANK( BK10, $BK$5:$BK$18, 0 ) / 10^2 + RANK( BL10, $BL$5:$BL$18, 0 ) / 10^4 + RANK( BQ10, $BQ$5:$BQ$18, 0 ) / 10^6 + RANK( BO10, $BO$5:$BO$18, 0 ) / 10^8 + BS10 / 10^10","v":0.99010104060000004},{"$f":"P10","v":"Daltons"},{"$f":"3 * BL10 + BN10","v":18},{"$f":"SUM( BL10:BN10 )","v":6},{"$f":"CHOOSE(StandBer,COUNTIF(BW40:CJ40,\"t\")+COUNTIF(CB35:CB48,\"u\")+COUNTIF(CL40:CY40,\"t\")+COUNTIF(CQ35:CQ48,\"u\"),COUNTIF(BW40:CJ40,\"t\")+COUNTIF(CB35:CB48,\"u\"),COUNTIF(CL40:CY40,\"t\")+COUNTIF(CQ35:CQ48,\"u\"),COUNTIF(BW40:CJ40,\"t\")+COUNTIF(CL40:CY40,\"t\"),COUNTIF(CB35:CB48,\"u\")+COUNTIF(CQ35:CQ48,\"u\"))","v":6},{"$f":"CHOOSE(StandBer,COUNTIF(BW40:CJ40,\"u\")+COUNTIF(CB35:CB48,\"t\")+COUNTIF(CL40:CY40,\"u\")+COUNTIF(CQ35:CQ48,\"t\"),COUNTIF(BW40:CJ40,\"u\")+COUNTIF(CB35:CB48,\"t\"),COUNTIF(CL40:CY40,\"u\")+COUNTIF(CQ35:CQ48,\"t\"),COUNTIF(BW40:CJ40,\"u\")+COUNTIF(CL40:CY40,\"u\"),COUNTIF(CB35:CB48,\"t\")+COUNTIF(CQ35:CQ48,\"t\"))+BR10","v":0},{"$f":"CHOOSE(StandBer,COUNTIF(BW40:CJ40,\"g\")+COUNTIF(CB35:CB48,\"g\")+COUNTIF(CL40:CY40,\"g\")+COUNTIF(CQ35:CQ48,\"g\"),COUNTIF(BW40:CJ40,\"g\")+COUNTIF(CB35:CB48,\"g\"),COUNTIF(CL40:CY40,\"g\")+COUNTIF(CQ35:CQ48,\"g\"),COUNTIF(BW40:CJ40,\"g\")+COUNTIF(CL40:CY40,\"g\"),COUNTIF(CB35:CB48,\"g\")+COUNTIF(CQ35:CQ48,\"g\"))","v":0},{"$f":"CHOOSE(StandBer,SUM(BW10:CJ10)+SUM(CB20:CB33)+SUM(CL10:CY10)+SUM(CQ20:CQ33),SUM(BW10:CJ10)+SUM(CB20:CB33),SUM(CL10:CY10)+SUM(CQ20:CQ33),SUM(BW10:CJ10)+SUM(CL10:CY10),SUM(CB20:CB33)+SUM(CQ20:CQ33))-5*BR10","v":24},{"$f":"CHOOSE(StandBer,SUM(CB5:CB18)+SUM(BW25:CJ25)+SUM(CQ5:CQ18)+SUM(CL25:CY25),SUM(CB5:CB18)+SUM(BW25:CJ25),SUM(CQ5:CQ18)+SUM(CL25:CY25),SUM(CB5:CB18)+SUM(CQ5:CQ18),SUM(BW25:CJ25)+SUM(CL25:CY25))","v":6},{"$f":"BO10 - BP10","v":18},{"$f":"CHOOSE(StandBer,COUNTIF(BW40:CJ40,\"ff\")+COUNTIF(CB35:CB48,\"ff\")+COUNTIF(CL40:CY40,\"ff\")+COUNTIF(CQ35:CQ48,\"ff\"),COUNTIF(BW40:CJ40,\"ff\")+COUNTIF(CB35:CB48,\"ff\"),COUNTIF(CL40:CY40,\"ff\")+COUNTIF(CQ35:CQ48,\"ff\"),COUNTIF(BW40:CJ40,\"ff\")+COUNTIF(CL40:CY40,\"ff\"),COUNTIF(CB35:CB48,\"ff\")+COUNTIF(CQ35:CQ48,\"ff\"))","v":0},6,{"$f":"SMALL( $BH$5:$BH$18, BS10 )","v":3.9906020214},null,6,{"$f":"IF(OR(ISERROR(FIND(\"-\",Q10)),AE10>'export html'!$AR$7),\"\",IF(LEFT(Q10,1)<>\"*\",LEFT(Q10,FIND(\"-\",Q10)-1)-0,MID(Q10,2,FIND(\"-\",Q10)-2)-0))","v":""},{"$f":"IF(OR(ISERROR(FIND(\"-\",R10)),AF10>'export html'!$AR$7),\"\",IF(LEFT(R10,1)<>\"*\",LEFT(R10,FIND(\"-\",R10)-1)-0,MID(R10,2,FIND(\"-\",R10)-2)-0))","v":""},{"$f":"IF(OR(ISERROR(FIND(\"-\",S10)),AG10>'export html'!$AR$7),\"\",IF(LEFT(S10,1)<>\"*\",LEFT(S10,FIND(\"-\",S10)-1)-0,MID(S10,2,FIND(\"-\",S10)-2)-0))","v":""},{"$f":"IF(OR(ISERROR(FIND(\"-\",T10)),AH10>'export html'!$AR$7),\"\",IF(LEFT(T10,1)<>\"*\",LEFT(T10,FIND(\"-\",T10)-1)-0,MID(T10,2,FIND(\"-\",T10)-2)-0))","v":""},{"$f":"IF(OR(ISERROR(FIND(\"-\",U10)),AI10>'export html'!$AR$7),\"\",IF(LEFT(U10,1)<>\"*\",LEFT(U10,FIND(\"-\",U10)-1)-0,MID(U10,2,FIND(\"-\",U10)-2)-0))","v":4},null,{"$f":"IF(OR(ISERROR(FIND(\"-\",W10)),AK10>'export html'!$AR$7),\"\",IF(LEFT(W10,1)<>\"*\",LEFT(W10,FIND(\"-\",W10)-1)-0,MID(W10,2,FIND(\"-\",W10)-2)-0))","v":""},{"$f":"IF(OR(ISERROR(FIND(\"-\",X10)),AL10>'export html'!$AR$7),\"\",IF(LEFT(X10,1)<>\"*\",LEFT(X10,FIND(\"-\",X10)-1)-0,MID(X10,2,FIND(\"-\",X10)-2)-0))","v":""},{"$f":"IF(OR(ISERROR(FIND(\"-\",Y10)),AM10>'export html'!$AR$7),\"\",IF(LEFT(Y10,1)<>\"*\",LEFT(Y10,FIND(\"-\",Y10)-1)-0,MID(Y10,2,FIND(\"-\",Y10)-2)-0))","v":""},{"$f":"IF(OR(ISERROR(FIND(\"-\",Z10)),AN10>'export html'!$AR$7),\"\",IF(LEFT(Z10,1)<>\"*\",LEFT(Z10,FIND(\"-\",Z10)-1)-0,MID(Z10,2,FIND(\"-\",Z10)-2)-0))","v":3},{"$f":"IF(OR(ISERROR(FIND(\"-\",AA10)),AO10>'export html'!$AR$7),\"\",IF(LEFT(AA10,1)<>\"*\",LEFT(AA10,FIND(\"-\",AA10)-1)-0,MID(AA10,2,FIND(\"-\",AA10)-2)-0))","v":""},{"$f":"IF(OR(ISERROR(FIND(\"-\",AB10)),AP10>'export html'!$AR$7),\"\",IF(LEFT(AB10,1)<>\"*\",LEFT(AB10,FIND(\"-\",AB10)-1)-0,MID(AB10,2,FIND(\"-\",AB10)-2)-0))","v":""},{"$f":"IF(OR(ISERROR(FIND(\"-\",AC10)),AQ10>'export html'!$AR$7),\"\",IF(LEFT(AC10,1)<>\"*\",LEFT(AC10,FIND(\"-\",AC10)-1)-0,MID(AC10,2,FIND(\"-\",AC10)-2)-0))","v":4},{"$f":"IF(OR(ISERROR(FIND(\"-\",AD10)),AR10>'export html'!$AR$7),\"\",IF(LEFT(AD10,1)<>\"*\",LEFT(AD10,FIND(\"-\",AD10)-1)-0,MID(AD10,2,FIND(\"-\",AD10)-2)-0))","v":""},6,{"$f":"IF(OR(ISERROR(FIND(\"-\",Q10)),AE10<='export html'!$AR$7),\"\",IF(LEFT(Q10,1)<>\"*\",LEFT(Q10,FIND(\"-\",Q10)-1)-0,MID(Q10,2,FIND(\"-\",Q10)-2)-0))","v":""},{"$f":"IF(OR(ISERROR(FIND(\"-\",R10)),AF10<='export html'!$AR$7),\"\",IF(LEFT(R10,1)<>\"*\",LEFT(R10,FIND(\"-\",R10)-1)-0,MID(R10,2,FIND(\"-\",R10)-2)-0))","v":""},{"$f":"IF(OR(ISERROR(FIND(\"-\",S10)),AG10<='export html'!$AR$7),\"\",IF(LEFT(S10,1)<>\"*\",LEFT(S10,FIND(\"-\",S10)-1)-0,MID(S10,2,FIND(\"-\",S10)-2)-0))","v":""},{"$f":"IF(OR(ISERROR(FIND(\"-\",T10)),AH10<='export html'!$AR$7),\"\",IF(LEFT(T10,1)<>\"*\",LEFT(T10,FIND(\"-\",T10)-1)-0,MID(T10,2,FIND(\"-\",T10)-2)-0))","v":""},{"$f":"IF(OR(ISERROR(FIND(\"-\",U10)),AI10<='export html'!$AR$7),\"\",IF(LEFT(U10,1)<>\"*\",LEFT(U10,FIND(\"-\",U10)-1)-0,MID(U10,2,FIND(\"-\",U10)-2)-0))","v":""},null,{"$f":"IF(OR(ISERROR(FIND(\"-\",W10)),AK10<='export html'!$AR$7),\"\",IF(LEFT(W10,1)<>\"*\",LEFT(W10,FIND(\"-\",W10)-1)-0,MID(W10,2,FIND(\"-\",W10)-2)-0))","v":""},{"$f":"IF(OR(ISERROR(FIND(\"-\",X10)),AL10<='export html'!$AR$7),\"\",IF(LEFT(X10,1)<>\"*\",LEFT(X10,FIND(\"-\",X10)-1)-0,MID(X10,2,FIND(\"-\",X10)-2)-0))","v":""},{"$f":"IF(OR(ISERROR(FIND(\"-\",Y10)),AM10<='export html'!$AR$7),\"\",IF(LEFT(Y10,1)<>\"*\",LEFT(Y10,FIND(\"-\",Y10)-1)-0,MID(Y10,2,FIND(\"-\",Y10)-2)-0))","v":""},{"$f":"IF(OR(ISERROR(FIND(\"-\",Z10)),AN10<='export html'!$AR$7),\"\",IF(LEFT(Z10,1)<>\"*\",LEFT(Z10,FIND(\"-\",Z10)-1)-0,MID(Z10,2,FIND(\"-\",Z10)-2)-0))","v":""},{"$f":"IF(OR(ISERROR(FIND(\"-\",AA10)),AO10<='export html'!$AR$7),\"\",IF(LEFT(AA10,1)<>\"*\",LEFT(AA10,FIND(\"-\",AA10)-1)-0,MID(AA10,2,FIND(\"-\",AA10)-2)-0))","v":""},{"$f":"IF(OR(ISERROR(FIND(\"-\",AB10)),AP10<='export html'!$AR$7),\"\",IF(LEFT(AB10,1)<>\"*\",LEFT(AB10,FIND(\"-\",AB10)-1)-0,MID(AB10,2,FIND(\"-\",AB10)-2)-0))","v":""},{"$f":"IF(OR(ISERROR(FIND(\"-\",AC10)),AQ10<='export html'!$AR$7),\"\",IF(LEFT(AC10,1)<>\"*\",LEFT(AC10,FIND(\"-\",AC10)-1)-0,MID(AC10,2,FIND(\"-\",AC10)-2)-0))","v":""},{"$f":"IF(OR(ISERROR(FIND(\"-\",AD10)),AR10<='export html'!$AR$7),\"\",IF(LEFT(AD10,1)<>\"*\",LEFT(AD10,FIND(\"-\",AD10)-1)-0,MID(AD10,2,FIND(\"-\",AD10)-2)-0))","v":""},6]
[null,null,7,"Racing Emblem",9,6,"",3,3,0,16,20,-4,9,null,"Goka",null,null,null,"3-1",null,null,null,null,null,"3-0","2-5",null,null,null,9,18,20,4,13,25,null,11,8,2,6,14,23,16,"2024-11-03","2025-02-02","2025-02-16","2024-09-22","2024-12-01","2025-03-30",null,"2024-11-17","2024-10-20","2024-09-08","2024-10-06","2024-12-08","2025-03-16","2025-01-19",null,9.9908121107000003,"Goka",6,6,{"$f":"CHOOSE(StandBer,COUNTIF(BW41:CJ41,\"t\")+COUNTIF(CC35:CC48,\"u\")+COUNTIF(CL41:CY41,\"t\")+COUNTIF(CR35:CR48,\"u\"),COUNTIF(BW41:CJ41,\"t\")+COUNTIF(CC35:CC48,\"u\"),COUNTIF(CL41:CY41,\"t\")+COUNTIF(CR35:CR48,\"u\"),COUNTIF(BW41:CJ41,\"t\")+COUNTIF(CL41:CY41,\"t\"),COUNTIF(CC35:CC48,\"u\")+COUNTIF(CR35:CR48,\"u\"))","v":2},{"$f":"CHOOSE(StandBer,COUNTIF(BW41:CJ41,\"u\")+COUNTIF(CC35:CC48,\"t\")+COUNTIF(CL41:CY41,\"u\")+COUNTIF(CR35:CR48,\"t\"),COUNTIF(BW41:CJ41,\"u\")+COUNTIF(CC35:CC48,\"t\"),COUNTIF(CL41:CY41,\"u\")+COUNTIF(CR35:CR48,\"t\"),COUNTIF(BW41:CJ41,\"u\")+COUNTIF(CL41:CY41,\"u\"),COUNTIF(CC35:CC48,\"t\")+COUNTIF(CR35:CR48,\"t\"))+BR11","v":4},{"$f":"CHOOSE(StandBer,COUNTIF(BW41:CJ41,\"g\")+COUNTIF(CC35:CC48,\"g\")+COUNTIF(CL41:CY41,\"g\")+COUNTIF(CR35:CR48,\"g\"),COUNTIF(BW41:CJ41,\"g\")+COUNTIF(CC35:CC48,\"g\"),COUNTIF(CL41:CY41,\"g\")+COUNTIF(CR35:CR48,\"g\"),COUNTIF(BW41:CJ41,\"g\")+COUNTIF(CL41:CY41,\"g\"),COUNTIF(CC35:CC48,\"g\")+COUNTIF(CR35:CR48,\"g\"))","v":0},{"$f":"CHOOSE(StandBer,SUM(BW11:CJ11)+SUM(CC20:CC33)+SUM(CL11:CY11)+SUM(CR20:CR33),SUM(BW11:CJ11)+SUM(CC20:CC33),SUM(CL11:CY11)+SUM(CR20:CR33),SUM(BW11:CJ11)+SUM(CL11:CY11),SUM(CC20:CC33)+SUM(CR20:CR33))-5*BR11","v":14},{"$f":"CHOOSE(StandBer,SUM(CC5:CC18)+SUM(BW26:CJ26)+SUM(CR5:CR18)+SUM(CL26:CY26),SUM(CC5:CC18)+SUM(BW26:CJ26),SUM(CR5:CR18)+SUM(CL26:CY26),SUM(CC5:CC18)+SUM(CR5:CR18),SUM(BW26:CJ26)+SUM(CL26:CY26))","v":23},-9,{"$f":"CHOOSE(StandBer,COUNTIF(BW41:CJ41,\"ff\")+COUNTIF(CC35:CC48,\"ff\")+COUNTIF(CL41:CY41,\"ff\")+COUNTIF(CR35:CR48,\"ff\"),COUNTIF(BW41:CJ41,\"ff\")+COUNTIF(CC35:CC48,\"ff\"),COUNTIF(CL41:CY41,\"ff\")+COUNTIF(CR35:CR48,\"ff\"),COUNTIF(BW41:CJ41,\"ff\")+COUNTIF(CL41:CY41,\"ff\"),COUNTIF(CC35:CC48,\"ff\")+COUNTIF(CR35:CR48,\"ff\"))","v":0},7,6.9906090911000014,null,7,{"$f":"IF(OR(ISERROR(FIND(\"-\",Q11)),AE11>'export html'!$AR$7),\"\",IF(LEFT(Q11,1)<>\"*\",LEFT(Q11,FIND(\"-\",Q11)-1)-0,MID(Q11,2,FIND(\"-\",Q11)-2)-0))","v":""},{"$f":"IF(OR(ISERROR(FIND(\"-\",R11)),AF11>'export html'!$AR$7),\"\",IF(LEFT(R11,1)<>\"*\",LEFT(R11,FIND(\"-\",R11)-1)-0,MID(R11,2,FIND(\"-\",R11)-2)-0))","v":""},{"$f":"IF(OR(ISERROR(FIND(\"-\",S11)),AG11>'export html'!$AR$7),\"\",IF(LEFT(S11,1)<>\"*\",LEFT(S11,FIND(\"-\",S11)-1)-0,MID(S11,2,FIND(\"-\",S11)-2)-0))","v":""},{"$f":"IF(OR(ISERROR(FIND(\"-\",T11)),AH11>'export html'!$AR$7),\"\",IF(LEFT(T11,1)<>\"*\",LEFT(T11,FIND(\"-\",T11)-1)-0,MID(T11,2,FIND(\"-\",T11)-2)-0))","v":3},{"$f":"IF(OR(ISERROR(FIND(\"-\",U11)),AI11>'export html'!$AR$7),\"\",IF(LEFT(U11,1)<>\"*\",LEFT(U11,FIND(\"-\",U11)-1)-0,MID(U11,2,FIND(\"-\",U11)-2)-0))","v":""},{"$f":"IF(OR(ISERROR(FIND(\"-\",V11)),AJ11>'export html'!$AR$7),\"\",IF(LEFT(V11,1)<>\"*\",LEFT(V11,FIND(\"-\",V11)-1)-0,MID(V11,2,FIND(\"-\",V11)-2)-0))","v":""},null,{"$f":"IF(OR(ISERROR(FIND(\"-\",X11)),AL11>'export html'!$AR$7),\"\",IF(LEFT(X11,1)<>\"*\",LEFT(X11,FIND(\"-\",X11)-1)-0,MID(X11,2,FIND(\"-\",X11)-2)-0))","v":""},{"$f":"IF(OR(ISERROR(FIND(\"-\",Y11)),AM11>'export html'!$AR$7),\"\",IF(LEFT(Y11,1)<>\"*\",LEFT(Y11,FIND(\"-\",Y11)-1)-0,MID(Y11,2,FIND(\"-\",Y11)-2)-0))","v":""},{"$f":"IF(OR(ISERROR(FIND(\"-\",Z11)),AN11>'export html'!$AR$7),\"\",IF(LEFT(Z11,1)<>\"*\",LEFT(Z11,FIND(\"-\",Z11)-1)-0,MID(Z11,2,FIND(\"-\",Z11)-2)-0))","v":3},{"$f":"IF(OR(ISERROR(FIND(\"-\",AA11)),AO11>'export html'!$AR$7),\"\",IF(LEFT(AA11,1)<>\"*\",LEFT(AA11,FIND(\"-\",AA11)-1)-0,MID(AA11,2,FIND(\"-\",AA11)-2)-0))","v":2},{"$f":"IF(OR(ISERROR(FIND(\"-\",AB11)),AP11>'export html'!$AR$7),\"\",IF(LEFT(AB11,1)<>\"*\",LEFT(AB11,FIND(\"-\",AB11)-1)-0,MID(AB11,2,FIND(\"-\",AB11)-2)-0))","v":""},{"$f":"IF(OR(ISERROR(FIND(\"-\",AC11)),AQ11>'export html'!$AR$7),\"\",IF(LEFT(AC11,1)<>\"*\",LEFT(AC11,FIND(\"-\",AC11)-1)-0,MID(AC11,2,FIND(\"-\",AC11)-2)-0))","v":""},{"$f":"IF(OR(ISERROR(FIND(\"-\",AD11)),AR11>'export html'!$AR$7),\"\",IF(LEFT(AD11,1)<>\"*\",LEFT(AD11,FIND(\"-\",AD11)-1)-0,MID(AD11,2,FIND(\"-\",AD11)-2)-0))","v":""},7,{"$f":"IF(OR(ISERROR(FIND(\"-\",Q11)),AE11<='export html'!$AR$7),\"\",IF(LEFT(Q11,1)<>\"*\",LEFT(Q11,FIND(\"-\",Q11)-1)-0,MID(Q11,2,FIND(\"-\",Q11)-2)-0))","v":""},{"$f":"IF(OR(ISERROR(FIND(\"-\",R11)),AF11<='export html'!$AR$7),\"\",IF(LEFT(R11,1)<>\"*\",LEFT(R11,FIND(\"-\",R11)-1)-0,MID(R11,2,FIND(\"-\",R11)-2)-0))","v":""},{"$f":"IF(OR(ISERROR(FIND(\"-\",S11)),AG11<='export html'!$AR$7),\"\",IF(LEFT(S11,1)<>\"*\",LEFT(S11,FIND(\"-\",S11)-1)-0,MID(S11,2,FIND(\"-\",S11)-2)-0))","v":""},{"$f":"IF(OR(ISERROR(FIND(\"-\",T11)),AH11<='export html'!$AR$7),\"\",IF(LEFT(T11,1)<>\"*\",LEFT(T11,FIND(\"-\",T11)-1)-0,MID(T11,2,FIND(\"-\",T11)-2)-0))","v":""},{"$f":"IF(OR(ISERROR(FIND(\"-\",U11)),AI11<='export html'!$AR$7),\"\",IF(LEFT(U11,1)<>\"*\",LEFT(U11,FIND(\"-\",U11)-1)-0,MID(U11,2,FIND(\"-\",U11)-2)-0))","v":""},{"$f":"IF(OR(ISERROR(FIND(\"-\",V11)),AJ11<='export html'!$AR$7),\"\",IF(LEFT(V11,1)<>\"*\",LEFT(V11,FIND(\"-\",V11)-1)-0,MID(V11,2,FIND(\"-\",V11)-2)-0))","v":""},null,{"$f":"IF(OR(ISERROR(FIND(\"-\",X11)),AL11<='export html'!$AR$7),\"\",IF(LEFT(X11,1)<>\"*\",LEFT(X11,FIND(\"-\",X11)-1)-0,MID(X11,2,FIND(\"-\",X11)-2)-0))","v":""},{"$f":"IF(OR(ISERROR(FIND(\"-\",Y11)),AM11<='export html'!$AR$7),\"\",IF(LEFT(Y11,1)<>\"*\",LEFT(Y11,FIND(\"-\",Y11)-1)-0,MID(Y11,2,FIND(\"-\",Y11)-2)-0))","v":""},{"$f":"IF(OR(ISERROR(FIND(\"-\",Z11)),AN11<='export html'!$AR$7),\"\",IF(LEFT(Z11,1)<>\"*\",LEFT(Z11,FIND(\"-\",Z11)-1)-0,MID(Z11,2,FIND(\"-\",Z11)-2)-0))","v":""},{"$f":"IF(OR(ISERROR(FIND(\"-\",AA11)),AO11<='export html'!$AR$7),\"\",IF(LEFT(AA11,1)<>\"*\",LEFT(AA11,FIND(\"-\",AA11)-1)-0,MID(AA11,2,FIND(\"-\",AA11)-2)-0))","v":""},{"$f":"IF(OR(ISERROR(FIND(\"-\",AB11)),AP11<='export html'!$AR$7),\"\",IF(LEFT(AB11,1)<>\"*\",LEFT(AB11,FIND(\"-\",AB11)-1)-0,MID(AB11,2,FIND(\"-\",AB11)-2)-0))","v":""},{"$f":"IF(OR(ISERROR(FIND(\"-\",AC11)),AQ11<='export html'!$AR$7),\"\",IF(LEFT(AC11,1)<>\"*\",LEFT(AC11,FIND(\"-\",AC11)-1)-0,MID(AC11,2,FIND(\"-\",AC11)-2)-0))","v":""},{"$f":"IF(OR(ISERROR(FIND(\"-\",AD11)),AR11<='export html'!$AR$7),\"\",IF(LEFT(AD11,1)<>\"*\",LEFT(AD11,FIND(\"-\",AD11)-1)-0,MID(AD11,2,FIND(\"-\",AD11)-2)-0))","v":""},7]
[null,null,8,"Hombeek",7,6,{"$f":"REPT(IF(F12-MODE($F$5:$F$18)<0,\"-\",\"+\"),ABS(F12-MODE($F$5:$F$18)))","v":""},2,3,1,17,19,-2,11,null,"Hombeek",null,null,null,null,null,"2-3",null,null,null,null,null,"2-6",null,"1-1",12,8,10,20,16,2,24,null,14,18,22,4,26,6,"2024-11-24","2024-10-20","2024-11-10","2025-02-16","2025-01-19","2024-09-08","2025-03-23",null,"2024-12-08","2025-02-02","2025-03-09","2024-09-22","2025-04-06","2024-10-06",null,{"$f":"RANK( BJ12, $BJ$5:$BJ$18, 0 ) - RANK( BK12, $BK$5:$BK$18, 0 ) / 10^2 + RANK( BL12, $BL$5:$BL$18, 0 ) / 10^4 + RANK( BQ12, $BQ$5:$BQ$18, 0 ) / 10^6 + RANK( BO12, $BO$5:$BO$18, 0 ) / 10^8 + BS12 / 10^10","v":7.9908070808000007},"Hombeek",7,6,{"$f":"CHOOSE(StandBer,COUNTIF(BW42:CJ42,\"t\")+COUNTIF(CD35:CD48,\"u\")+COUNTIF(CL42:CY42,\"t\")+COUNTIF(CS35:CS48,\"u\"),COUNTIF(BW42:CJ42,\"t\")+COUNTIF(CD35:CD48,\"u\"),COUNTIF(CL42:CY42,\"t\")+COUNTIF(CS35:CS48,\"u\"),COUNTIF(BW42:CJ42,\"t\")+COUNTIF(CL42:CY42,\"t\"),COUNTIF(CD35:CD48,\"u\")+COUNTIF(CS35:CS48,\"u\"))","v":2},{"$f":"CHOOSE(StandBer,COUNTIF(BW42:CJ42,\"u\")+COUNTIF(CD35:CD48,\"t\")+COUNTIF(CL42:CY42,\"u\")+COUNTIF(CS35:CS48,\"t\"),COUNTIF(BW42:CJ42,\"u\")+COUNTIF(CD35:CD48,\"t\"),COUNTIF(CL42:CY42,\"u\")+COUNTIF(CS35:CS48,\"t\"),COUNTIF(BW42:CJ42,\"u\")+COUNTIF(CL42:CY42,\"u\"),COUNTIF(CD35:CD48,\"t\")+COUNTIF(CS35:CS48,\"t\"))+BR12","v":3},{"$f":"CHOOSE(StandBer,COUNTIF(BW42:CJ42,\"g\")+COUNTIF(CD35:CD48,\"g\")+COUNTIF(CL42:CY42,\"g\")+COUNTIF(CS35:CS48,\"g\"),COUNTIF(BW42:CJ42,\"g\")+COUNTIF(CD35:CD48,\"g\"),COUNTIF(CL42:CY42,\"g\")+COUNTIF(CS35:CS48,\"g\"),COUNTIF(BW42:CJ42,\"g\")+COUNTIF(CL42:CY42,\"g\"),COUNTIF(CD35:CD48,\"g\")+COUNTIF(CS35:CS48,\"g\"))","v":1},{"$f":"CHOOSE(StandBer,SUM(BW12:CJ12)+SUM(CD20:CD33)+SUM(CL12:CY12)+SUM(CS20:CS33),SUM(BW12:CJ12)+SUM(CD20:CD33),SUM(CL12:CY12)+SUM(CS20:CS33),SUM(BW12:CJ12)+SUM(CL12:CY12),SUM(CD20:CD33)+SUM(CS20:CS33))-5*BR12","v":17},{"$f":"CHOOSE(StandBer,SUM(CD5:CD18)+SUM(BW27:CJ27)+SUM(CS5:CS18)+SUM(CL27:CY27),SUM(CD5:CD18)+SUM(BW27:CJ27),SUM(CS5:CS18)+SUM(CL27:CY27),SUM(CD5:CD18)+SUM(CS5:CS18),SUM(BW27:CJ27)+SUM(CL27:CY27))","v":19},-2,{"$f":"CHOOSE(StandBer,COUNTIF(BW42:CJ42,\"ff\")+COUNTIF(CD35:CD48,\"ff\")+COUNTIF(CL42:CY42,\"ff\")+COUNTIF(CS35:CS48,\"ff\"),COUNTIF(BW42:CJ42,\"ff\")+COUNTIF(CD35:CD48,\"ff\"),COUNTIF(CL42:CY42,\"ff\")+COUNTIF(CS35:CS48,\"ff\"),COUNTIF(BW42:CJ42,\"ff\")+COUNTIF(CL42:CY42,\"ff\"),COUNTIF(CD35:CD48,\"ff\")+COUNTIF(CS35:CS48,\"ff\"))","v":0},8,{"$f":"SMALL( $BH$5:$BH$18, BS12 )","v":7.9908070808000007},null,8,{"$f":"IF(OR(ISERROR(FIND(\"-\",Q12)),AE12>'export html'!$AR$7),\"\",IF(LEFT(Q12,1)<>\"*\",LEFT(Q12,FIND(\"-\",Q12)-1)-0,MID(Q12,2,FIND(\"-\",Q12)-2)-0))","v":""},{"$f":"IF(OR(ISERROR(FIND(\"-\",R12)),AF12>'export html'!$AR$7),\"\",IF(LEFT(R12,1)<>\"*\",LEFT(R12,FIND(\"-\",R12)-1)-0,MID(R12,2,FIND(\"-\",R12)-2)-0))","v":""},{"$f":"IF(OR(ISERROR(FIND(\"-\",S12)),AG12>'export html'!$AR$7),\"\",IF(LEFT(S12,1)<>\"*\",LEFT(S12,FIND(\"-\",S12)-1)-0,MID(S12,2,FIND(\"-\",S12)-2)-0))","v":""},{"$f":"IF(OR(ISERROR(FIND(\"-\",T12)),AH12>'export html'!$AR$7),\"\",IF(LEFT(T12,1)<>\"*\",LEFT(T12,FIND(\"-\",T12)-1)-0,MID(T12,2,FIND(\"-\",T12)-2)-0))","v":""},{"$f":"IF(OR(ISERROR(FIND(\"-\",U12)),AI12>'export html'!$AR$7),\"\",IF(LEFT(U12,1)<>\"*\",LEFT(U12,FIND(\"-\",U12)-1)-0,MID(U12,2,FIND(\"-\",U12)-2)-0))","v":""},{"$f":"IF(OR(ISERROR(FIND(\"-\",V12)),AJ12>'export html'!$AR$7),\"\",IF(LEFT(V12,1)<>\"*\",LEFT(V12,FIND(\"-\",V12)-1)-0,MID(V12,2,FIND(\"-\",V12)-2)-0))","v":2},{"$f":"IF(OR(ISERROR(FIND(\"-\",W12)),AK12>'export html'!$AR$7),\"\",IF(LEFT(W12,1)<>\"*\",LEFT(W12,FIND(\"-\",W12)-1)-0,MID(W12,2,FIND(\"-\",W12)-2)-0))","v":""},null,{"$f":"IF(OR(ISERROR(FIND(\"-\",Y12)),AM12>'export html'!$AR$7),\"\",IF(LEFT(Y12,1)<>\"*\",LEFT(Y12,FIND(\"-\",Y12)-1)-0,MID(Y12,2,FIND(\"-\",Y12)-2)-0))","v":""},{"$f":"IF(OR(ISERROR(FIND(\"-\",Z12)),AN12>'export html'!$AR$7),\"\",IF(LEFT(Z12,1)<>\"*\",LEFT(Z12,FIND(\"-\",Z12)-1)-0,MID(Z12,2,FIND(\"-\",Z12)-2)-0))","v":""},{"$f":"IF(OR(ISERROR(FIND(\"-\",AA12)),AO12>'export html'!$AR$7),\"\",IF(LEFT(AA12,1)<>\"*\",LEFT(AA12,FIND(\"-\",AA12)-1)-0,MID(AA12,2,FIND(\"-\",AA12)-2)-0))","v":""},{"$f":"IF(OR(ISERROR(FIND(\"-\",AB12)),AP12>'export html'!$AR$7),\"\",IF(LEFT(AB12,1)<>\"*\",LEFT(AB12,FIND(\"-\",AB12)-1)-0,MID(AB12,2,FIND(\"-\",AB12)-2)-0))","v":2},{"$f":"IF(OR(ISERROR(FIND(\"-\",AC12)),AQ12>'export html'!$AR$7),\"\",IF(LEFT(AC12,1)<>\"*\",LEFT(AC12,FIND(\"-\",AC12)-1)-0,MID(AC12,2,FIND(\"-\",AC12)-2)-0))","v":""},{"$f":"IF(OR(ISERROR(FIND(\"-\",AD12)),AR12>'export html'!$AR$7),\"\",IF(LEFT(AD12,1)<>\"*\",LEFT(AD12,FIND(\"-\",AD12)-1)-0,MID(AD12,2,FIND(\"-\",AD12)-2)-0))","v":1},8,{"$f":"IF(OR(ISERROR(FIND(\"-\",Q12)),AE12<='export html'!$AR$7),\"\",IF(LEFT(Q12,1)<>\"*\",LEFT(Q12,FIND(\"-\",Q12)-1)-0,MID(Q12,2,FIND(\"-\",Q12)-2)-0))","v":""},{"$f":"IF(OR(ISERROR(FIND(\"-\",R12)),AF12<='export html'!$AR$7),\"\",IF(LEFT(R12,1)<>\"*\",LEFT(R12,FIND(\"-\",R12)-1)-0,MID(R12,2,FIND(\"-\",R12)-2)-0))","v":""},{"$f":"IF(OR(ISERROR(FIND(\"-\",S12)),AG12<='export html'!$AR$7),\"\",IF(LEFT(S12,1)<>\"*\",LEFT(S12,FIND(\"-\",S12)-1)-0,MID(S12,2,FIND(\"-\",S12)-2)-0))","v":""},{"$f":"IF(OR(ISERROR(FIND(\"-\",T12)),AH12<='export html'!$AR$7),\"\",IF(LEFT(T12,1)<>\"*\",LEFT(T12,FIND(\"-\",T12)-1)-0,MID(T12,2,FIND(\"-\",T12)-2)-0))","v":""},{"$f":"IF(OR(ISERROR(FIND(\"-\",U12)),AI12<='export html'!$AR$7),\"\",IF(LEFT(U12,1)<>\"*\",LEFT(U12,FIND(\"-\",U12)-1)-0,MID(U12,2,FIND(\"-\",U12)-2)-0))","v":""},{"$f":"IF(OR(ISERROR(FIND(\"-\",V12)),AJ12<='export html'!$AR$7),\"\",IF(LEFT(V12,1)<>\"*\",LEFT(V12,FIND(\"-\",V12)-1)-0,MID(V12,2,FIND(\"-\",V12)-2)-0))","v":""},{"$f":"IF(OR(ISERROR(FIND(\"-\",W12)),AK12<='export html'!$AR$7),\"\",IF(LEFT(W12,1)<>\"*\",LEFT(W12,FIND(\"-\",W12)-1)-0,MID(W12,2,FIND(\"-\",W12)-2)-0))","v":""},null,{"$f":"IF(OR(ISERROR(FIND(\"-\",Y12)),AM12<='export html'!$AR$7),\"\",IF(LEFT(Y12,1)<>\"*\",LEFT(Y12,FIND(\"-\",Y12)-1)-0,MID(Y12,2,FIND(\"-\",Y12)-2)-0))","v":""},{"$f":"IF(OR(ISERROR(FIND(\"-\",Z12)),AN12<='export html'!$AR$7),\"\",IF(LEFT(Z12,1)<>\"*\",LEFT(Z12,FIND(\"-\",Z12)-1)-0,MID(Z12,2,FIND(\"-\",Z12)-2)-0))","v":""},{"$f":"IF(OR(ISERROR(FIND(\"-\",AA12)),AO12<='export html'!$AR$7),\"\",IF(LEFT(AA12,1)<>\"*\",LEFT(AA12,FIND(\"-\",AA12)-1)-0,MID(AA12,2,FIND(\"-\",AA12)-2)-0))","v":""},{"$f":"IF(OR(ISERROR(FIND(\"-\",AB12)),AP12<='export html'!$AR$7),\"\",IF(LEFT(AB12,1)<>\"*\",LEFT(AB12,FIND(\"-\",AB12)-1)-0,MID(AB12,2,FIND(\"-\",AB12)-2)-0))","v":""},{"$f":"IF(OR(ISERROR(FIND(\"-\",AC12)),AQ12<='export html'!$AR$7),\"\",IF(LEFT(AC12,1)<>\"*\",LEFT(AC12,FIND(\"-\",AC12)-1)-0,MID(AC12,2,FIND(\"-\",AC12)-2)-0))","v":""},{"$f":"IF(OR(ISERROR(FIND(\"-\",AD12)),AR12<='export html'!$AR$7),\"\",IF(LEFT(AD12,1)<>\"*\",LEFT(AD12,FIND(\"-\",AD12)-1)-0,MID(AD12,2,FIND(\"-\",AD12)-2)-0))","v":""},8]
[null,null,"",{"$f":"VLOOKUP(BT13,HulpberekeningenStand,2,FALSE)","v":"Bariton"},7,6,"",{"$f":"VLOOKUP(BT13,HulpberekeningenStand,5,FALSE)","v":2},{"$f":"VLOOKUP(BT13,HulpberekeningenStand,6,FALSE)","v":3},{"$f":"VLOOKUP(BT13,HulpberekeningenStand,7,FALSE)","v":1},{"$f":"VLOOKUP(BT13,HulpberekeningenStand,8,FALSE)","v":16},{"$f":"VLOOKUP(BT13,HulpberekeningenStand,9,FALSE)","v":19},-3,11,null,"Jolika",null,null,null,null,"1-8","0-7",null,"0-6",null,null,null,null,null,null,23,15,19,26,5,3,21,1,null,9,17,7,12,11,"2025-03-16","2025-01-12","2025-02-09","2025-04-06","2024-09-29","2024-09-15","2025-02-23","2024-09-01",null,"2024-11-03","2025-01-26","2024-10-13","2024-11-24","2024-11-17",null,13.9914141409,"Jolika",0,6,{"$f":"CHOOSE(StandBer,COUNTIF(BW43:CJ43,\"t\")+COUNTIF(CE35:CE48,\"u\")+COUNTIF(CL43:CY43,\"t\")+COUNTIF(CT35:CT48,\"u\"),COUNTIF(BW43:CJ43,\"t\")+COUNTIF(CE35:CE48,\"u\"),COUNTIF(CL43:CY43,\"t\")+COUNTIF(CT35:CT48,\"u\"),COUNTIF(BW43:CJ43,\"t\")+COUNTIF(CL43:CY43,\"t\"),COUNTIF(CE35:CE48,\"u\")+COUNTIF(CT35:CT48,\"u\"))","v":0},{"$f":"CHOOSE(StandBer,COUNTIF(BW43:CJ43,\"u\")+COUNTIF(CE35:CE48,\"t\")+COUNTIF(CL43:CY43,\"u\")+COUNTIF(CT35:CT48,\"t\"),COUNTIF(BW43:CJ43,\"u\")+COUNTIF(CE35:CE48,\"t\"),COUNTIF(CL43:CY43,\"u\")+COUNTIF(CT35:CT48,\"t\"),COUNTIF(BW43:CJ43,\"u\")+COUNTIF(CL43:CY43,\"u\"),COUNTIF(CE35:CE48,\"t\")+COUNTIF(CT35:CT48,\"t\"))+BR13","v":6},{"$f":"CHOOSE(StandBer,COUNTIF(BW43:CJ43,\"g\")+COUNTIF(CE35:CE48,\"g\")+COUNTIF(CL43:CY43,\"g\")+COUNTIF(CT35:CT48,\"g\"),COUNTIF(BW43:CJ43,\"g\")+COUNTIF(CE35:CE48,\"g\"),COUNTIF(CL43:CY43,\"g\")+COUNTIF(CT35:CT48,\"g\"),COUNTIF(BW43:CJ43,\"g\")+COUNTIF(CL43:CY43,\"g\"),COUNTIF(CE35:CE48,\"g\")+COUNTIF(CT35:CT48,\"g\"))","v":0},{"$f":"CHOOSE(StandBer,SUM(BW13:CJ13)+SUM(CE20:CE33)+SUM(CL13:CY13)+SUM(CT20:CT33),SUM(BW13:CJ13)+SUM(CE20:CE33),SUM(CL13:CY13)+SUM(CT20:CT33),SUM(BW13:CJ13)+SUM(CL13:CY13),SUM(CE20:CE33)+SUM(CT20:CT33))-5*BR13","v":2},{"$f":"CHOOSE(StandBer,SUM(CE5:CE18)+SUM(BW28:CJ28)+SUM(CT5:CT18)+SUM(CL28:CY28),SUM(CE5:CE18)+SUM(BW28:CJ28),SUM(CT5:CT18)+SUM(CL28:CY28),SUM(CE5:CE18)+SUM(CT5:CT18),SUM(BW28:CJ28)+SUM(CL28:CY28))","v":36},-34,{"$f":"CHOOSE(StandBer,COUNTIF(BW43:CJ43,\"ff\")+COUNTIF(CE35:CE48,\"ff\")+COUNTIF(CL43:CY43,\"ff\")+COUNTIF(CT35:CT48,\"ff\"),COUNTIF(BW43:CJ43,\"ff\")+COUNTIF(CE35:CE48,\"ff\"),COUNTIF(CL43:CY43,\"ff\")+COUNTIF(CT35:CT48,\"ff\"),COUNTIF(BW43:CJ43,\"ff\")+COUNTIF(CL43:CY43,\"ff\"),COUNTIF(CE35:CE48,\"ff\")+COUNTIF(CT35:CT48,\"ff\"))","v":0},9,7.9908080904000007,null,9,{"$f":"IF(OR(ISERROR(FIND(\"-\",Q13)),AE13>'export html'!$AR$7),\"\",IF(LEFT(Q13,1)<>\"*\",LEFT(Q13,FIND(\"-\",Q13)-1)-0,MID(Q13,2,FIND(\"-\",Q13)-2)-0))","v":""},{"$f":"IF(OR(ISERROR(FIND(\"-\",R13)),AF13>'export html'!$AR$7),\"\",IF(LEFT(R13,1)<>\"*\",LEFT(R13,FIND(\"-\",R13)-1)-0,MID(R13,2,FIND(\"-\",R13)-2)-0))","v":""},{"$f":"IF(OR(ISERROR(FIND(\"-\",S13)),AG13>'export html'!$AR$7),\"\",IF(LEFT(S13,1)<>\"*\",LEFT(S13,FIND(\"-\",S13)-1)-0,MID(S13,2,FIND(\"-\",S13)-2)-0))","v":""},{"$f":"IF(OR(ISERROR(FIND(\"-\",T13)),AH13>'export html'!$AR$7),\"\",IF(LEFT(T13,1)<>\"*\",LEFT(T13,FIND(\"-\",T13)-1)-0,MID(T13,2,FIND(\"-\",T13)-2)-0))","v":""},{"$f":"IF(OR(ISERROR(FIND(\"-\",U13)),AI13>'export html'!$AR$7),\"\",IF(LEFT(U13,1)<>\"*\",LEFT(U13,FIND(\"-\",U13)-1)-0,MID(U13,2,FIND(\"-\",U13)-2)-0))","v":1},{"$f":"IF(OR(ISERROR(FIND(\"-\",V13)),AJ13>'export html'!$AR$7),\"\",IF(LEFT(V13,1)<>\"*\",LEFT(V13,FIND(\"-\",V13)-1)-0,MID(V13,2,FIND(\"-\",V13)-2)-0))","v":0},{"$f":"IF(OR(ISERROR(FIND(\"-\",W13)),AK13>'export html'!$AR$7),\"\",IF(LEFT(W13,1)<>\"*\",LEFT(W13,FIND(\"-\",W13)-1)-0,MID(W13,2,FIND(\"-\",W13)-2)-0))","v":""},{"$f":"IF(OR(ISERROR(FIND(\"-\",X13)),AL13>'export html'!$AR$7),\"\",IF(LEFT(X13,1)<>\"*\",LEFT(X13,FIND(\"-\",X13)-1)-0,MID(X13,2,FIND(\"-\",X13)-2)-0))","v":0},null,{"$f":"IF(OR(ISERROR(FIND(\"-\",Z13)),AN13>'export html'!$AR$7),\"\",IF(LEFT(Z13,1)<>\"*\",LEFT(Z13,FIND(\"-\",Z13)-1)-0,MID(Z13,2,FIND(\"-\",Z13)-2)-0))","v":""},{"$f":"IF(OR(ISERROR(FIND(\"-\",AA13)),AO13>'export html'!$AR$7),\"\",IF(LEFT(AA13,1)<>\"*\",LEFT(AA13,FIND(\"-\",AA13)-1)-0,MID(AA13,2,FIND(\"-\",AA13)-2)-0))","v":""},{"$f":"IF(OR(ISERROR(FIND(\"-\",AB13)),AP13>'export html'!$AR$7),\"\",IF(LEFT(AB13,1)<>\"*\",LEFT(AB13,FIND(\"-\",AB13)-1)-0,MID(AB13,2,FIND(\"-\",AB13)-2)-0))","v":""},{"$f":"IF(OR(ISERROR(FIND(\"-\",AC13)),AQ13>'export html'!$AR$7),\"\",IF(LEFT(AC13,1)<>\"*\",LEFT(AC13,FIND(\"-\",AC13)-1)-0,MID(AC13,2,FIND(\"-\",AC13)-2)-0))","v":""},{"$f":"IF(OR(ISERROR(FIND(\"-\",AD13)),AR13>'export html'!$AR$7),\"\",IF(LEFT(AD13,1)<>\"*\",LEFT(AD13,FIND(\"-\",AD13)-1)-0,MID(AD13,2,FIND(\"-\",AD13)-2)-0))","v":""},9,{"$f":"IF(OR(ISERROR(FIND(\"-\",Q13)),AE13<='export html'!$AR$7),\"\",IF(LEFT(Q13,1)<>\"*\",LEFT(Q13,FIND(\"-\",Q13)-1)-0,MID(Q13,2,FIND(\"-\",Q13)-2)-0))","v":""},{"$f":"IF(OR(ISERROR(FIND(\"-\",R13)),AF13<='export html'!$AR$7),\"\",IF(LEFT(R13,1)<>\"*\",LEFT(R13,FIND(\"-\",R13)-1)-0,MID(R13,2,FIND(\"-\",R13)-2)-0))","v":""},{"$f":"IF(OR(ISERROR(FIND(\"-\",S13)),AG13<='export html'!$AR$7),\"\",IF(LEFT(S13,1)<>\"*\",LEFT(S13,FIND(\"-\",S13)-1)-0,MID(S13,2,FIND(\"-\",S13)-2)-0))","v":""},{"$f":"IF(OR(ISERROR(FIND(\"-\",T13)),AH13<='export html'!$AR$7),\"\",IF(LEFT(T13,1)<>\"*\",LEFT(T13,FIND(\"-\",T13)-1)-0,MID(T13,2,FIND(\"-\",T13)-2)-0))","v":""},{"$f":"IF(OR(ISERROR(FIND(\"-\",U13)),AI13<='export html'!$AR$7),\"\",IF(LEFT(U13,1)<>\"*\",LEFT(U13,FIND(\"-\",U13)-1)-0,MID(U13,2,FIND(\"-\",U13)-2)-0))","v":""},{"$f":"IF(OR(ISERROR(FIND(\"-\",V13)),AJ13<='export html'!$AR$7),\"\",IF(LEFT(V13,1)<>\"*\",LEFT(V13,FIND(\"-\",V13)-1)-0,MID(V13,2,FIND(\"-\",V13)-2)-0))","v":""},{"$f":"IF(OR(ISERROR(FIND(\"-\",W13)),AK13<='export html'!$AR$7),\"\",IF(LEFT(W13,1)<>\"*\",LEFT(W13,FIND(\"-\",W13)-1)-0,MID(W13,2,FIND(\"-\",W13)-2)-0))","v":""},{"$f":"IF(OR(ISERROR(FIND(\"-\",X13)),AL13<='export html'!$AR$7),\"\",IF(LEFT(X13,1)<>\"*\",LEFT(X13,FIND(\"-\",X13)-1)-0,MID(X13,2,FIND(\"-\",X13)-2)-0))","v":""},null,{"$f":"IF(OR(ISERROR(FIND(\"-\",Z13)),AN13<='export html'!$AR$7),\"\",IF(LEFT(Z13,1)<>\"*\",LEFT(Z13,FIND(\"-\",Z13)-1)-0,MID(Z13,2,FIND(\"-\",Z13)-2)-0))","v":""},{"$f":"IF(OR(ISERROR(FIND(\"-\",AA13)),AO13<='export html'!$AR$7),\"\",IF(LEFT(AA13,1)<>\"*\",LEFT(AA13,FIND(\"-\",AA13)-1)-0,MID(AA13,2,FIND(\"-\",AA13)-2)-0))","v":""},{"$f":"IF(OR(ISERROR(FIND(\"-\",AB13)),AP13<='export html'!$AR$7),\"\",IF(LEFT(AB13,1)<>\"*\",LEFT(AB13,FIND(\"-\",AB13)-1)-0,MID(AB13,2,FIND(\"-\",AB13)-2)-0))","v":""},{"$f":"IF(OR(ISERROR(FIND(\"-\",AC13)),AQ13<='export html'!$AR$7),\"\",IF(LEFT(AC13,1)<>\"*\",LEFT(AC13,FIND(\"-\",AC13)-1)-0,MID(AC13,2,FIND(\"-\",AC13)-2)-0))","v":""},{"$f":"IF(OR(ISERROR(FIND(\"-\",AD13)),AR13<='export html'!$AR$7),\"\",IF(LEFT(AD13,1)<>\"*\",LEFT(AD13,FIND(\"-\",AD13)-1)-0,MID(AD13,2,FIND(\"-\",AD13)-2)-0))","v":""},9]
[null,null,10,"Goka",{"$f":"3*H14+J14","v":6},{"$f":"SUM(H14:J14)","v":6},"",2,4,0,14,23,{"$f":"K14-L14","v":-9},{"$f":"3*F14-E14","v":12},null,"Lucyvo","1-5",null,"2-4",null,null,null,null,"5-1",null,null,null,null,null,null,3,12,1,24,7,19,15,5,22,null,26,21,17,10,"2024-09-15","2024-11-24","2024-09-01","2025-03-23","2024-10-13","2025-02-09","2025-01-12","2024-09-29","2025-03-09",null,"2025-04-06","2025-02-23","2024-12-22","2024-11-10",null,12.991113130999999,"Lucyvo",3,6,{"$f":"CHOOSE(StandBer,COUNTIF(BW44:CJ44,\"t\")+COUNTIF(CF35:CF48,\"u\")+COUNTIF(CL44:CY44,\"t\")+COUNTIF(CU35:CU48,\"u\"),COUNTIF(BW44:CJ44,\"t\")+COUNTIF(CF35:CF48,\"u\"),COUNTIF(CL44:CY44,\"t\")+COUNTIF(CU35:CU48,\"u\"),COUNTIF(BW44:CJ44,\"t\")+COUNTIF(CL44:CY44,\"t\"),COUNTIF(CF35:CF48,\"u\")+COUNTIF(CU35:CU48,\"u\"))","v":1},{"$f":"CHOOSE(StandBer,COUNTIF(BW44:CJ44,\"u\")+COUNTIF(CF35:CF48,\"t\")+COUNTIF(CL44:CY44,\"u\")+COUNTIF(CU35:CU48,\"t\"),COUNTIF(BW44:CJ44,\"u\")+COUNTIF(CF35:CF48,\"t\"),COUNTIF(CL44:CY44,\"u\")+COUNTIF(CU35:CU48,\"t\"),COUNTIF(BW44:CJ44,\"u\")+COUNTIF(CL44:CY44,\"u\"),COUNTIF(CF35:CF48,\"t\")+COUNTIF(CU35:CU48,\"t\"))+BR14","v":5},{"$f":"CHOOSE(StandBer,COUNTIF(BW44:CJ44,\"g\")+COUNTIF(CF35:CF48,\"g\")+COUNTIF(CL44:CY44,\"g\")+COUNTIF(CU35:CU48,\"g\"),COUNTIF(BW44:CJ44,\"g\")+COUNTIF(CF35:CF48,\"g\"),COUNTIF(CL44:CY44,\"g\")+COUNTIF(CU35:CU48,\"g\"),COUNTIF(BW44:CJ44,\"g\")+COUNTIF(CL44:CY44,\"g\"),COUNTIF(CF35:CF48,\"g\")+COUNTIF(CU35:CU48,\"g\"))","v":0},{"$f":"CHOOSE(StandBer,SUM(BW14:CJ14)+SUM(CF20:CF33)+SUM(CL14:CY14)+SUM(CU20:CU33),SUM(BW14:CJ14)+SUM(CF20:CF33),SUM(CL14:CY14)+SUM(CU20:CU33),SUM(BW14:CJ14)+SUM(CL14:CY14),SUM(CF20:CF33)+SUM(CU20:CU33))-5*BR14","v":9},{"$f":"CHOOSE(StandBer,SUM(CF5:CF18)+SUM(BW29:CJ29)+SUM(CU5:CU18)+SUM(CL29:CY29),SUM(CF5:CF18)+SUM(BW29:CJ29),SUM(CU5:CU18)+SUM(CL29:CY29),SUM(CF5:CF18)+SUM(CU5:CU18),SUM(BW29:CJ29)+SUM(CL29:CY29))","v":19},-10,{"$f":"CHOOSE(StandBer,COUNTIF(BW44:CJ44,\"ff\")+COUNTIF(CF35:CF48,\"ff\")+COUNTIF(CL44:CY44,\"ff\")+COUNTIF(CU35:CU48,\"ff\"),COUNTIF(BW44:CJ44,\"ff\")+COUNTIF(CF35:CF48,\"ff\"),COUNTIF(CL44:CY44,\"ff\")+COUNTIF(CU35:CU48,\"ff\"),COUNTIF(BW44:CJ44,\"ff\")+COUNTIF(CL44:CY44,\"ff\"),COUNTIF(CF35:CF48,\"ff\")+COUNTIF(CU35:CU48,\"ff\"))","v":0},10,9.9908121107000003,null,10,{"$f":"IF(OR(ISERROR(FIND(\"-\",Q14)),AE14>'export html'!$AR$7),\"\",IF(LEFT(Q14,1)<>\"*\",LEFT(Q14,FIND(\"-\",Q14)-1)-0,MID(Q14,2,FIND(\"-\",Q14)-2)-0))","v":1},{"$f":"IF(OR(ISERROR(FIND(\"-\",R14)),AF14>'export html'!$AR$7),\"\",IF(LEFT(R14,1)<>\"*\",LEFT(R14,FIND(\"-\",R14)-1)-0,MID(R14,2,FIND(\"-\",R14)-2)-0))","v":""},{"$f":"IF(OR(ISERROR(FIND(\"-\",S14)),AG14>'export html'!$AR$7),\"\",IF(LEFT(S14,1)<>\"*\",LEFT(S14,FIND(\"-\",S14)-1)-0,MID(S14,2,FIND(\"-\",S14)-2)-0))","v":2},{"$f":"IF(OR(ISERROR(FIND(\"-\",T14)),AH14>'export html'!$AR$7),\"\",IF(LEFT(T14,1)<>\"*\",LEFT(T14,FIND(\"-\",T14)-1)-0,MID(T14,2,FIND(\"-\",T14)-2)-0))","v":""},{"$f":"IF(OR(ISERROR(FIND(\"-\",U14)),AI14>'export html'!$AR$7),\"\",IF(LEFT(U14,1)<>\"*\",LEFT(U14,FIND(\"-\",U14)-1)-0,MID(U14,2,FIND(\"-\",U14)-2)-0))","v":""},{"$f":"IF(OR(ISERROR(FIND(\"-\",V14)),AJ14>'export html'!$AR$7),\"\",IF(LEFT(V14,1)<>\"*\",LEFT(V14,FIND(\"-\",V14)-1)-0,MID(V14,2,FIND(\"-\",V14)-2)-0))","v":""},{"$f":"IF(OR(ISERROR(FIND(\"-\",W14)),AK14>'export html'!$AR$7),\"\",IF(LEFT(W14,1)<>\"*\",LEFT(W14,FIND(\"-\",W14)-1)-0,MID(W14,2,FIND(\"-\",W14)-2)-0))","v":""},{"$f":"IF(OR(ISERROR(FIND(\"-\",X14)),AL14>'export html'!$AR$7),\"\",IF(LEFT(X14,1)<>\"*\",LEFT(X14,FIND(\"-\",X14)-1)-0,MID(X14,2,FIND(\"-\",X14)-2)-0))","v":5},{"$f":"IF(OR(ISERROR(FIND(\"-\",Y14)),AM14>'export html'!$AR$7),\"\",IF(LEFT(Y14,1)<>\"*\",LEFT(Y14,FIND(\"-\",Y14)-1)-0,MID(Y14,2,FIND(\"-\",Y14)-2)-0))","v":""},null,{"$f":"IF(OR(ISERROR(FIND(\"-\",AA14)),AO14>'export html'!$AR$7),\"\",IF(LEFT(AA14,1)<>\"*\",LEFT(AA14,FIND(\"-\",AA14)-1)-0,MID(AA14,2,FIND(\"-\",AA14)-2)-0))","v":""},{"$f":"IF(OR(ISERROR(FIND(\"-\",AB14)),AP14>'export html'!$AR$7),\"\",IF(LEFT(AB14,1)<>\"*\",LEFT(AB14,FIND(\"-\",AB14)-1)-0,MID(AB14,2,FIND(\"-\",AB14)-2)-0))","v":""},{"$f":"IF(OR(ISERROR(FIND(\"-\",AC14)),AQ14>'export html'!$AR$7),\"\",IF(LEFT(AC14,1)<>\"*\",LEFT(AC14,FIND(\"-\",AC14)-1)-0,MID(AC14,2,FIND(\"-\",AC14)-2)-0))","v":""},{"$f":"IF(OR(ISERROR(FIND(\"-\",AD14)),AR14>'export html'!$AR$7),\"\",IF(LEFT(AD14,1)<>\"*\",LEFT(AD14,FIND(\"-\",AD14)-1)-0,MID(AD14,2,FIND(\"-\",AD14)-2)-0))","v":""},10,{"$f":"IF(OR(ISERROR(FIND(\"-\",Q14)),AE14<='export html'!$AR$7),\"\",IF(LEFT(Q14,1)<>\"*\",LEFT(Q14,FIND(\"-\",Q14)-1)-0,MID(Q14,2,FIND(\"-\",Q14)-2)-0))","v":""},{"$f":"IF(OR(ISERROR(FIND(\"-\",R14)),AF14<='export html'!$AR$7),\"\",IF(LEFT(R14,1)<>\"*\",LEFT(R14,FIND(\"-\",R14)-1)-0,MID(R14,2,FIND(\"-\",R14)-2)-0))","v":""},{"$f":"IF(OR(ISERROR(FIND(\"-\",S14)),AG14<='export html'!$AR$7),\"\",IF(LEFT(S14,1)<>\"*\",LEFT(S14,FIND(\"-\",S14)-1)-0,MID(S14,2,FIND(\"-\",S14)-2)-0))","v":""},{"$f":"IF(OR(ISERROR(FIND(\"-\",T14)),AH14<='export html'!$AR$7),\"\",IF(LEFT(T14,1)<>\"*\",LEFT(T14,FIND(\"-\",T14)-1)-0,MID(T14,2,FIND(\"-\",T14)-2)-0))","v":""},{"$f":"IF(OR(ISERROR(FIND(\"-\",U14)),AI14<='export html'!$AR$7),\"\",IF(LEFT(U14,1)<>\"*\",LEFT(U14,FIND(\"-\",U14)-1)-0,MID(U14,2,FIND(\"-\",U14)-2)-0))","v":""},{"$f":"IF(OR(ISERROR(FIND(\"-\",V14)),AJ14<='export html'!$AR$7),\"\",IF(LEFT(V14,1)<>\"*\",LEFT(V14,FIND(\"-\",V14)-1)-0,MID(V14,2,FIND(\"-\",V14)-2)-0))","v":""},{"$f":"IF(OR(ISERROR(FIND(\"-\",W14)),AK14<='export html'!$AR$7),\"\",IF(LEFT(W14,1)<>\"*\",LEFT(W14,FIND(\"-\",W14)-1)-0,MID(W14,2,FIND(\"-\",W14)-2)-0))","v":""},{"$f":"IF(OR(ISERROR(FIND(\"-\",X14)),AL14<='export html'!$AR$7),\"\",IF(LEFT(X14,1)<>\"*\",LEFT(X14,FIND(\"-\",X14)-1)-0,MID(X14,2,FIND(\"-\",X14)-2)-0))","v":""},{"$f":"IF(OR(ISERROR(FIND(\"-\",Y14)),AM14<='export html'!$AR$7),\"\",IF(LEFT(Y14,1)<>\"*\",LEFT(Y14,FIND(\"-\",Y14)-1)-0,MID(Y14,2,FIND(\"-\",Y14)-2)-0))","v":""},null,{"$f":"IF(OR(ISERROR(FIND(\"-\",AA14)),AO14<='export html'!$AR$7),\"\",IF(LEFT(AA14,1)<>\"*\",LEFT(AA14,FIND(\"-\",AA14)-1)-0,MID(AA14,2,FIND(\"-\",AA14)-2)-0))","v":""},{"$f":"IF(OR(ISERROR(FIND(\"-\",AB14)),AP14<='export html'!$AR$7),\"\",IF(LEFT(AB14,1)<>\"*\",LEFT(AB14,FIND(\"-\",AB14)-1)-0,MID(AB14,2,FIND(\"-\",AB14)-2)-0))","v":""},{"$f":"IF(OR(ISERROR(FIND(\"-\",AC14)),AQ14<='export html'!$AR$7),\"\",IF(LEFT(AC14,1)<>\"*\",LEFT(AC14,FIND(\"-\",AC14)-1)-0,MID(AC14,2,FIND(\"-\",AC14)-2)-0))","v":""},{"$f":"IF(OR(ISERROR(FIND(\"-\",AD14)),AR14<='export html'!$AR$7),\"\",IF(LEFT(AD14,1)<>\"*\",LEFT(AD14,FIND(\"-\",AD14)-1)-0,MID(AD14,2,FIND(\"-\",AD14)-2)-0))","v":""},10]
[null,null,11,"SC Duffel",5,6,"",1,3,2,12,19,-7,13,null,"Racing Emblem",null,null,"2-0","0-5*",null,null,null,null,"4-1",null,null,null,null,null,7,16,5,2,11,23,19,9,4,13,null,25,21,14,"2024-10-13","2025-01-19","2024-09-29","2024-09-08","2024-11-17","2025-03-16","2025-02-09","2024-11-03","2024-09-22","2024-12-01",null,"2025-03-30","2025-02-23","2024-12-08",null,6.9906090911000014,"Racing Emblem",9,6,{"$f":"CHOOSE(StandBer,COUNTIF(BW45:CJ45,\"t\")+COUNTIF(CG35:CG48,\"u\")+COUNTIF(CL45:CY45,\"t\")+COUNTIF(CV35:CV48,\"u\"),COUNTIF(BW45:CJ45,\"t\")+COUNTIF(CG35:CG48,\"u\"),COUNTIF(CL45:CY45,\"t\")+COUNTIF(CV35:CV48,\"u\"),COUNTIF(BW45:CJ45,\"t\")+COUNTIF(CL45:CY45,\"t\"),COUNTIF(CG35:CG48,\"u\")+COUNTIF(CV35:CV48,\"u\"))","v":3},{"$f":"CHOOSE(StandBer,COUNTIF(BW45:CJ45,\"u\")+COUNTIF(CG35:CG48,\"t\")+COUNTIF(CL45:CY45,\"u\")+COUNTIF(CV35:CV48,\"t\"),COUNTIF(BW45:CJ45,\"u\")+COUNTIF(CG35:CG48,\"t\"),COUNTIF(CL45:CY45,\"u\")+COUNTIF(CV35:CV48,\"t\"),COUNTIF(BW45:CJ45,\"u\")+COUNTIF(CL45:CY45,\"u\"),COUNTIF(CG35:CG48,\"t\")+COUNTIF(CV35:CV48,\"t\"))+BR15","v":3},{"$f":"CHOOSE(StandBer,COUNTIF(BW45:CJ45,\"g\")+COUNTIF(CG35:CG48,\"g\")+COUNTIF(CL45:CY45,\"g\")+COUNTIF(CV35:CV48,\"g\"),COUNTIF(BW45:CJ45,\"g\")+COUNTIF(CG35:CG48,\"g\"),COUNTIF(CL45:CY45,\"g\")+COUNTIF(CV35:CV48,\"g\"),COUNTIF(BW45:CJ45,\"g\")+COUNTIF(CL45:CY45,\"g\"),COUNTIF(CG35:CG48,\"g\")+COUNTIF(CV35:CV48,\"g\"))","v":0},{"$f":"CHOOSE(StandBer,SUM(BW15:CJ15)+SUM(CG20:CG33)+SUM(CL15:CY15)+SUM(CV20:CV33),SUM(BW15:CJ15)+SUM(CG20:CG33),SUM(CL15:CY15)+SUM(CV20:CV33),SUM(BW15:CJ15)+SUM(CL15:CY15),SUM(CG20:CG33)+SUM(CV20:CV33))-5*BR15","v":16},{"$f":"CHOOSE(StandBer,SUM(CG5:CG18)+SUM(BW30:CJ30)+SUM(CV5:CV18)+SUM(CL30:CY30),SUM(CG5:CG18)+SUM(BW30:CJ30),SUM(CV5:CV18)+SUM(CL30:CY30),SUM(CG5:CG18)+SUM(CV5:CV18),SUM(BW30:CJ30)+SUM(CL30:CY30))","v":20},-4,{"$f":"CHOOSE(StandBer,COUNTIF(BW45:CJ45,\"ff\")+COUNTIF(CG35:CG48,\"ff\")+COUNTIF(CL45:CY45,\"ff\")+COUNTIF(CV35:CV48,\"ff\"),COUNTIF(BW45:CJ45,\"ff\")+COUNTIF(CG35:CG48,\"ff\"),COUNTIF(CL45:CY45,\"ff\")+COUNTIF(CV35:CV48,\"ff\"),COUNTIF(BW45:CJ45,\"ff\")+COUNTIF(CL45:CY45,\"ff\"),COUNTIF(CG35:CG48,\"ff\")+COUNTIF(CV35:CV48,\"ff\"))","v":0},11,10.991111121299999,null,11,{"$f":"IF(OR(ISERROR(FIND(\"-\",Q15)),AE15>'export html'!$AR$7),\"\",IF(LEFT(Q15,1)<>\"*\",LEFT(Q15,FIND(\"-\",Q15)-1)-0,MID(Q15,2,FIND(\"-\",Q15)-2)-0))","v":""},{"$f":"IF(OR(ISERROR(FIND(\"-\",R15)),AF15>'export html'!$AR$7),\"\",IF(LEFT(R15,1)<>\"*\",LEFT(R15,FIND(\"-\",R15)-1)-0,MID(R15,2,FIND(\"-\",R15)-2)-0))","v":""},{"$f":"IF(OR(ISERROR(FIND(\"-\",S15)),AG15>'export html'!$AR$7),\"\",IF(LEFT(S15,1)<>\"*\",LEFT(S15,FIND(\"-\",S15)-1)-0,MID(S15,2,FIND(\"-\",S15)-2)-0))","v":2},{"$f":"IF(OR(ISERROR(FIND(\"-\",T15)),AH15>'export html'!$AR$7),\"\",IF(LEFT(T15,1)<>\"*\",LEFT(T15,FIND(\"-\",T15)-1)-0,MID(T15,2,FIND(\"-\",T15)-2)-0))","v":0},{"$f":"IF(OR(ISERROR(FIND(\"-\",U15)),AI15>'export html'!$AR$7),\"\",IF(LEFT(U15,1)<>\"*\",LEFT(U15,FIND(\"-\",U15)-1)-0,MID(U15,2,FIND(\"-\",U15)-2)-0))","v":""},{"$f":"IF(OR(ISERROR(FIND(\"-\",V15)),AJ15>'export html'!$AR$7),\"\",IF(LEFT(V15,1)<>\"*\",LEFT(V15,FIND(\"-\",V15)-1)-0,MID(V15,2,FIND(\"-\",V15)-2)-0))","v":""},{"$f":"IF(OR(ISERROR(FIND(\"-\",W15)),AK15>'export html'!$AR$7),\"\",IF(LEFT(W15,1)<>\"*\",LEFT(W15,FIND(\"-\",W15)-1)-0,MID(W15,2,FIND(\"-\",W15)-2)-0))","v":""},{"$f":"IF(OR(ISERROR(FIND(\"-\",X15)),AL15>'export html'!$AR$7),\"\",IF(LEFT(X15,1)<>\"*\",LEFT(X15,FIND(\"-\",X15)-1)-0,MID(X15,2,FIND(\"-\",X15)-2)-0))","v":""},{"$f":"IF(OR(ISERROR(FIND(\"-\",Y15)),AM15>'export html'!$AR$7),\"\",IF(LEFT(Y15,1)<>\"*\",LEFT(Y15,FIND(\"-\",Y15)-1)-0,MID(Y15,2,FIND(\"-\",Y15)-2)-0))","v":4},{"$f":"IF(OR(ISERROR(FIND(\"-\",Z15)),AN15>'export html'!$AR$7),\"\",IF(LEFT(Z15,1)<>\"*\",LEFT(Z15,FIND(\"-\",Z15)-1)-0,MID(Z15,2,FIND(\"-\",Z15)-2)-0))","v":""},null,{"$f":"IF(OR(ISERROR(FIND(\"-\",AB15)),AP15>'export html'!$AR$7),\"\",IF(LEFT(AB15,1)<>\"*\",LEFT(AB15,FIND(\"-\",AB15)-1)-0,MID(AB15,2,FIND(\"-\",AB15)-2)-0))","v":""},{"$f":"IF(OR(ISERROR(FIND(\"-\",AC15)),AQ15>'export html'!$AR$7),\"\",IF(LEFT(AC15,1)<>\"*\",LEFT(AC15,FIND(\"-\",AC15)-1)-0,MID(AC15,2,FIND(\"-\",AC15)-2)-0))","v":""},{"$f":"IF(OR(ISERROR(FIND(\"-\",AD15)),AR15>'export html'!$AR$7),\"\",IF(LEFT(AD15,1)<>\"*\",LEFT(AD15,FIND(\"-\",AD15)-1)-0,MID(AD15,2,FIND(\"-\",AD15)-2)-0))","v":""},11,{"$f":"IF(OR(ISERROR(FIND(\"-\",Q15)),AE15<='export html'!$AR$7),\"\",IF(LEFT(Q15,1)<>\"*\",LEFT(Q15,FIND(\"-\",Q15)-1)-0,MID(Q15,2,FIND(\"-\",Q15)-2)-0))","v":""},{"$f":"IF(OR(ISERROR(FIND(\"-\",R15)),AF15<='export html'!$AR$7),\"\",IF(LEFT(R15,1)<>\"*\",LEFT(R15,FIND(\"-\",R15)-1)-0,MID(R15,2,FIND(\"-\",R15)-2)-0))","v":""},{"$f":"IF(OR(ISERROR(FIND(\"-\",S15)),AG15<='export html'!$AR$7),\"\",IF(LEFT(S15,1)<>\"*\",LEFT(S15,FIND(\"-\",S15)-1)-0,MID(S15,2,FIND(\"-\",S15)-2)-0))","v":""},{"$f":"IF(OR(ISERROR(FIND(\"-\",T15)),AH15<='export html'!$AR$7),\"\",IF(LEFT(T15,1)<>\"*\",LEFT(T15,FIND(\"-\",T15)-1)-0,MID(T15,2,FIND(\"-\",T15)-2)-0))","v":""},{"$f":"IF(OR(ISERROR(FIND(\"-\",U15)),AI15<='export html'!$AR$7),\"\",IF(LEFT(U15,1)<>\"*\",LEFT(U15,FIND(\"-\",U15)-1)-0,MID(U15,2,FIND(\"-\",U15)-2)-0))","v":""},{"$f":"IF(OR(ISERROR(FIND(\"-\",V15)),AJ15<='export html'!$AR$7),\"\",IF(LEFT(V15,1)<>\"*\",LEFT(V15,FIND(\"-\",V15)-1)-0,MID(V15,2,FIND(\"-\",V15)-2)-0))","v":""},{"$f":"IF(OR(ISERROR(FIND(\"-\",W15)),AK15<='export html'!$AR$7),\"\",IF(LEFT(W15,1)<>\"*\",LEFT(W15,FIND(\"-\",W15)-1)-0,MID(W15,2,FIND(\"-\",W15)-2)-0))","v":""},{"$f":"IF(OR(ISERROR(FIND(\"-\",X15)),AL15<='export html'!$AR$7),\"\",IF(LEFT(X15,1)<>\"*\",LEFT(X15,FIND(\"-\",X15)-1)-0,MID(X15,2,FIND(\"-\",X15)-2)-0))","v":""},{"$f":"IF(OR(ISERROR(FIND(\"-\",Y15)),AM15<='export html'!$AR$7),\"\",IF(LEFT(Y15,1)<>\"*\",LEFT(Y15,FIND(\"-\",Y15)-1)-0,MID(Y15,2,FIND(\"-\",Y15)-2)-0))","v":""},{"$f":"IF(OR(ISERROR(FIND(\"-\",Z15)),AN15<='export html'!$AR$7),\"\",IF(LEFT(Z15,1)<>\"*\",LEFT(Z15,FIND(\"-\",Z15)-1)-0,MID(Z15,2,FIND(\"-\",Z15)-2)-0))","v":""},null,{"$f":"IF(OR(ISERROR(FIND(\"-\",AB15)),AP15<='export html'!$AR$7),\"\",IF(LEFT(AB15,1)<>\"*\",LEFT(AB15,FIND(\"-\",AB15)-1)-0,MID(AB15,2,FIND(\"-\",AB15)-2)-0))","v":""},{"$f":"IF(OR(ISERROR(FIND(\"-\",AC15)),AQ15<='export html'!$AR$7),\"\",IF(LEFT(AC15,1)<>\"*\",LEFT(AC15,FIND(\"-\",AC15)-1)-0,MID(AC15,2,FIND(\"-\",AC15)-2)-0))","v":""},{"$f":"IF(OR(ISERROR(FIND(\"-\",AD15)),AR15<='export html'!$AR$7),\"\",IF(LEFT(AD15,1)<>\"*\",LEFT(AD15,FIND(\"-\",AD15)-1)-0,MID(AD15,2,FIND(\"-\",AD15)-2)-0))","v":""},11]
[null,null,12,"Corum",4,6,"",1,4,1,20,26,-6,14,null,"Sint Anneke",null,null,null,null,null,"2-3","5-2",null,null,null,null,null,"6-3",null,15,24,26,10,19,5,1,17,20,8,12,null,3,22,"2025-01-12","2025-03-23","2025-04-06","2024-11-10","2025-02-09","2024-09-29","2024-09-01","2025-01-26","2025-02-16","2024-10-20","2024-11-24",null,"2024-09-15","2025-03-09",null,3.9902050112,"Sint Anneke",12,6,{"$f":"CHOOSE(StandBer,COUNTIF(BW46:CJ46,\"t\")+COUNTIF(CH35:CH48,\"u\")+COUNTIF(CL46:CY46,\"t\")+COUNTIF(CW35:CW48,\"u\"),COUNTIF(BW46:CJ46,\"t\")+COUNTIF(CH35:CH48,\"u\"),COUNTIF(CL46:CY46,\"t\")+COUNTIF(CW35:CW48,\"u\"),COUNTIF(BW46:CJ46,\"t\")+COUNTIF(CL46:CY46,\"t\"),COUNTIF(CH35:CH48,\"u\")+COUNTIF(CW35:CW48,\"u\"))","v":4},{"$f":"CHOOSE(StandBer,COUNTIF(BW46:CJ46,\"u\")+COUNTIF(CH35:CH48,\"t\")+COUNTIF(CL46:CY46,\"u\")+COUNTIF(CW35:CW48,\"t\"),COUNTIF(BW46:CJ46,\"u\")+COUNTIF(CH35:CH48,\"t\"),COUNTIF(CL46:CY46,\"u\")+COUNTIF(CW35:CW48,\"t\"),COUNTIF(BW46:CJ46,\"u\")+COUNTIF(CL46:CY46,\"u\"),COUNTIF(CH35:CH48,\"t\")+COUNTIF(CW35:CW48,\"t\"))+BR16","v":2},{"$f":"CHOOSE(StandBer,COUNTIF(BW46:CJ46,\"g\")+COUNTIF(CH35:CH48,\"g\")+COUNTIF(CL46:CY46,\"g\")+COUNTIF(CW35:CW48,\"g\"),COUNTIF(BW46:CJ46,\"g\")+COUNTIF(CH35:CH48,\"g\"),COUNTIF(CL46:CY46,\"g\")+COUNTIF(CW35:CW48,\"g\"),COUNTIF(BW46:CJ46,\"g\")+COUNTIF(CL46:CY46,\"g\"),COUNTIF(CH35:CH48,\"g\")+COUNTIF(CW35:CW48,\"g\"))","v":0},{"$f":"CHOOSE(StandBer,SUM(BW16:CJ16)+SUM(CH20:CH33)+SUM(CL16:CY16)+SUM(CW20:CW33),SUM(BW16:CJ16)+SUM(CH20:CH33),SUM(CL16:CY16)+SUM(CW20:CW33),SUM(BW16:CJ16)+SUM(CL16:CY16),SUM(CH20:CH33)+SUM(CW20:CW33))-5*BR16","v":29},{"$f":"CHOOSE(StandBer,SUM(CH5:CH18)+SUM(BW31:CJ31)+SUM(CW5:CW18)+SUM(CL31:CY31),SUM(CH5:CH18)+SUM(BW31:CJ31),SUM(CW5:CW18)+SUM(CL31:CY31),SUM(CH5:CH18)+SUM(CW5:CW18),SUM(BW31:CJ31)+SUM(CL31:CY31))","v":20},9,{"$f":"CHOOSE(StandBer,COUNTIF(BW46:CJ46,\"ff\")+COUNTIF(CH35:CH48,\"ff\")+COUNTIF(CL46:CY46,\"ff\")+COUNTIF(CW35:CW48,\"ff\"),COUNTIF(BW46:CJ46,\"ff\")+COUNTIF(CH35:CH48,\"ff\"),COUNTIF(CL46:CY46,\"ff\")+COUNTIF(CW35:CW48,\"ff\"),COUNTIF(BW46:CJ46,\"ff\")+COUNTIF(CL46:CY46,\"ff\"),COUNTIF(CH35:CH48,\"ff\")+COUNTIF(CW35:CW48,\"ff\"))","v":0},12,11.9911100705,null,12,{"$f":"IF(OR(ISERROR(FIND(\"-\",Q16)),AE16>'export html'!$AR$7),\"\",IF(LEFT(Q16,1)<>\"*\",LEFT(Q16,FIND(\"-\",Q16)-1)-0,MID(Q16,2,FIND(\"-\",Q16)-2)-0))","v":""},{"$f":"IF(OR(ISERROR(FIND(\"-\",R16)),AF16>'export html'!$AR$7),\"\",IF(LEFT(R16,1)<>\"*\",LEFT(R16,FIND(\"-\",R16)-1)-0,MID(R16,2,FIND(\"-\",R16)-2)-0))","v":""},{"$f":"IF(OR(ISERROR(FIND(\"-\",S16)),AG16>'export html'!$AR$7),\"\",IF(LEFT(S16,1)<>\"*\",LEFT(S16,FIND(\"-\",S16)-1)-0,MID(S16,2,FIND(\"-\",S16)-2)-0))","v":""},{"$f":"IF(OR(ISERROR(FIND(\"-\",T16)),AH16>'export html'!$AR$7),\"\",IF(LEFT(T16,1)<>\"*\",LEFT(T16,FIND(\"-\",T16)-1)-0,MID(T16,2,FIND(\"-\",T16)-2)-0))","v":""},{"$f":"IF(OR(ISERROR(FIND(\"-\",U16)),AI16>'export html'!$AR$7),\"\",IF(LEFT(U16,1)<>\"*\",LEFT(U16,FIND(\"-\",U16)-1)-0,MID(U16,2,FIND(\"-\",U16)-2)-0))","v":""},{"$f":"IF(OR(ISERROR(FIND(\"-\",V16)),AJ16>'export html'!$AR$7),\"\",IF(LEFT(V16,1)<>\"*\",LEFT(V16,FIND(\"-\",V16)-1)-0,MID(V16,2,FIND(\"-\",V16)-2)-0))","v":2},{"$f":"IF(OR(ISERROR(FIND(\"-\",W16)),AK16>'export html'!$AR$7),\"\",IF(LEFT(W16,1)<>\"*\",LEFT(W16,FIND(\"-\",W16)-1)-0,MID(W16,2,FIND(\"-\",W16)-2)-0))","v":5},{"$f":"IF(OR(ISERROR(FIND(\"-\",X16)),AL16>'export html'!$AR$7),\"\",IF(LEFT(X16,1)<>\"*\",LEFT(X16,FIND(\"-\",X16)-1)-0,MID(X16,2,FIND(\"-\",X16)-2)-0))","v":""},{"$f":"IF(OR(ISERROR(FIND(\"-\",Y16)),AM16>'export html'!$AR$7),\"\",IF(LEFT(Y16,1)<>\"*\",LEFT(Y16,FIND(\"-\",Y16)-1)-0,MID(Y16,2,FIND(\"-\",Y16)-2)-0))","v":""},{"$f":"IF(OR(ISERROR(FIND(\"-\",Z16)),AN16>'export html'!$AR$7),\"\",IF(LEFT(Z16,1)<>\"*\",LEFT(Z16,FIND(\"-\",Z16)-1)-0,MID(Z16,2,FIND(\"-\",Z16)-2)-0))","v":""},{"$f":"IF(OR(ISERROR(FIND(\"-\",AA16)),AO16>'export html'!$AR$7),\"\",IF(LEFT(AA16,1)<>\"*\",LEFT(AA16,FIND(\"-\",AA16)-1)-0,MID(AA16,2,FIND(\"-\",AA16)-2)-0))","v":""},null,{"$f":"IF(OR(ISERROR(FIND(\"-\",AC16)),AQ16>'export html'!$AR$7),\"\",IF(LEFT(AC16,1)<>\"*\",LEFT(AC16,FIND(\"-\",AC16)-1)-0,MID(AC16,2,FIND(\"-\",AC16)-2)-0))","v":6},{"$f":"IF(OR(ISERROR(FIND(\"-\",AD16)),AR16>'export html'!$AR$7),\"\",IF(LEFT(AD16,1)<>\"*\",LEFT(AD16,FIND(\"-\",AD16)-1)-0,MID(AD16,2,FIND(\"-\",AD16)-2)-0))","v":""},12,{"$f":"IF(OR(ISERROR(FIND(\"-\",Q16)),AE16<='export html'!$AR$7),\"\",IF(LEFT(Q16,1)<>\"*\",LEFT(Q16,FIND(\"-\",Q16)-1)-0,MID(Q16,2,FIND(\"-\",Q16)-2)-0))","v":""},{"$f":"IF(OR(ISERROR(FIND(\"-\",R16)),AF16<='export html'!$AR$7),\"\",IF(LEFT(R16,1)<>\"*\",LEFT(R16,FIND(\"-\",R16)-1)-0,MID(R16,2,FIND(\"-\",R16)-2)-0))","v":""},{"$f":"IF(OR(ISERROR(FIND(\"-\",S16)),AG16<='export html'!$AR$7),\"\",IF(LEFT(S16,1)<>\"*\",LEFT(S16,FIND(\"-\",S16)-1)-0,MID(S16,2,FIND(\"-\",S16)-2)-0))","v":""},{"$f":"IF(OR(ISERROR(FIND(\"-\",T16)),AH16<='export html'!$AR$7),\"\",IF(LEFT(T16,1)<>\"*\",LEFT(T16,FIND(\"-\",T16)-1)-0,MID(T16,2,FIND(\"-\",T16)-2)-0))","v":""},{"$f":"IF(OR(ISERROR(FIND(\"-\",U16)),AI16<='export html'!$AR$7),\"\",IF(LEFT(U16,1)<>\"*\",LEFT(U16,FIND(\"-\",U16)-1)-0,MID(U16,2,FIND(\"-\",U16)-2)-0))","v":""},{"$f":"IF(OR(ISERROR(FIND(\"-\",V16)),AJ16<='export html'!$AR$7),\"\",IF(LEFT(V16,1)<>\"*\",LEFT(V16,FIND(\"-\",V16)-1)-0,MID(V16,2,FIND(\"-\",V16)-2)-0))","v":""},{"$f":"IF(OR(ISERROR(FIND(\"-\",W16)),AK16<='export html'!$AR$7),\"\",IF(LEFT(W16,1)<>\"*\",LEFT(W16,FIND(\"-\",W16)-1)-0,MID(W16,2,FIND(\"-\",W16)-2)-0))","v":""},{"$f":"IF(OR(ISERROR(FIND(\"-\",X16)),AL16<='export html'!$AR$7),\"\",IF(LEFT(X16,1)<>\"*\",LEFT(X16,FIND(\"-\",X16)-1)-0,MID(X16,2,FIND(\"-\",X16)-2)-0))","v":""},{"$f":"IF(OR(ISERROR(FIND(\"-\",Y16)),AM16<='export html'!$AR$7),\"\",IF(LEFT(Y16,1)<>\"*\",LEFT(Y16,FIND(\"-\",Y16)-1)-0,MID(Y16,2,FIND(\"-\",Y16)-2)-0))","v":""},{"$f":"IF(OR(ISERROR(FIND(\"-\",Z16)),AN16<='export html'!$AR$7),\"\",IF(LEFT(Z16,1)<>\"*\",LEFT(Z16,FIND(\"-\",Z16)-1)-0,MID(Z16,2,FIND(\"-\",Z16)-2)-0))","v":""},{"$f":"IF(OR(ISERROR(FIND(\"-\",AA16)),AO16<='export html'!$AR$7),\"\",IF(LEFT(AA16,1)<>\"*\",LEFT(AA16,FIND(\"-\",AA16)-1)-0,MID(AA16,2,FIND(\"-\",AA16)-2)-0))","v":""},null,{"$f":"IF(OR(ISERROR(FIND(\"-\",AC16)),AQ16<='export html'!$AR$7),\"\",IF(LEFT(AC16,1)<>\"*\",LEFT(AC16,FIND(\"-\",AC16)-1)-0,MID(AC16,2,FIND(\"-\",AC16)-2)-0))","v":""},{"$f":"IF(OR(ISERROR(FIND(\"-\",AD16)),AR16<='export html'!$AR$7),\"\",IF(LEFT(AD16,1)<>\"*\",LEFT(AD16,FIND(\"-\",AD16)-1)-0,MID(AD16,2,FIND(\"-\",AD16)-2)-0))","v":""},12]
[null,null,13,"Lucyvo",{"$f":"3*H17+J17","v":3},{"$f":"SUM(H17:J17)","v":6},"",1,5,0,9,19,{"$f":"K17-L17","v":-10},{"$f":"3*F17-E17","v":15},null,"SC Duffel",null,null,null,"1-1","3-3",null,null,null,null,"3-1",null,null,null,null,24,20,22,6,2,14,10,13,25,4,8,16,null,18,"2025-03-22","2025-02-15","2025-03-08","2024-10-05","2024-09-07","2024-12-07","2024-11-09","2024-11-30","2025-03-29","2024-09-21","2024-10-19","2025-01-18",null,"2025-02-01",null,10.991111121299999,"SC Duffel",5,6,{"$f":"CHOOSE(StandBer,COUNTIF(BW47:CJ47,\"t\")+COUNTIF(CI35:CI48,\"u\")+COUNTIF(CL47:CY47,\"t\")+COUNTIF(CX35:CX48,\"u\"),COUNTIF(BW47:CJ47,\"t\")+COUNTIF(CI35:CI48,\"u\"),COUNTIF(CL47:CY47,\"t\")+COUNTIF(CX35:CX48,\"u\"),COUNTIF(BW47:CJ47,\"t\")+COUNTIF(CL47:CY47,\"t\"),COUNTIF(CI35:CI48,\"u\")+COUNTIF(CX35:CX48,\"u\"))","v":1},{"$f":"CHOOSE(StandBer,COUNTIF(BW47:CJ47,\"u\")+COUNTIF(CI35:CI48,\"t\")+COUNTIF(CL47:CY47,\"u\")+COUNTIF(CX35:CX48,\"t\"),COUNTIF(BW47:CJ47,\"u\")+COUNTIF(CI35:CI48,\"t\"),COUNTIF(CL47:CY47,\"u\")+COUNTIF(CX35:CX48,\"t\"),COUNTIF(BW47:CJ47,\"u\")+COUNTIF(CL47:CY47,\"u\"),COUNTIF(CI35:CI48,\"t\")+COUNTIF(CX35:CX48,\"t\"))+BR17","v":3},{"$f":"CHOOSE(StandBer,COUNTIF(BW47:CJ47,\"g\")+COUNTIF(CI35:CI48,\"g\")+COUNTIF(CL47:CY47,\"g\")+COUNTIF(CX35:CX48,\"g\"),COUNTIF(BW47:CJ47,\"g\")+COUNTIF(CI35:CI48,\"g\"),COUNTIF(CL47:CY47,\"g\")+COUNTIF(CX35:CX48,\"g\"),COUNTIF(BW47:CJ47,\"g\")+COUNTIF(CL47:CY47,\"g\"),COUNTIF(CI35:CI48,\"g\")+COUNTIF(CX35:CX48,\"g\"))","v":2},{"$f":"CHOOSE(StandBer,SUM(BW17:CJ17)+SUM(CI20:CI33)+SUM(CL17:CY17)+SUM(CX20:CX33),SUM(BW17:CJ17)+SUM(CI20:CI33),SUM(CL17:CY17)+SUM(CX20:CX33),SUM(BW17:CJ17)+SUM(CL17:CY17),SUM(CI20:CI33)+SUM(CX20:CX33))-5*BR17","v":12},{"$f":"CHOOSE(StandBer,SUM(CI5:CI18)+SUM(BW32:CJ32)+SUM(CX5:CX18)+SUM(CL32:CY32),SUM(CI5:CI18)+SUM(BW32:CJ32),SUM(CX5:CX18)+SUM(CL32:CY32),SUM(CI5:CI18)+SUM(CX5:CX18),SUM(BW32:CJ32)+SUM(CL32:CY32))","v":19},-7,{"$f":"CHOOSE(StandBer,COUNTIF(BW47:CJ47,\"ff\")+COUNTIF(CI35:CI48,\"ff\")+COUNTIF(CL47:CY47,\"ff\")+COUNTIF(CX35:CX48,\"ff\"),COUNTIF(BW47:CJ47,\"ff\")+COUNTIF(CI35:CI48,\"ff\"),COUNTIF(CL47:CY47,\"ff\")+COUNTIF(CX35:CX48,\"ff\"),COUNTIF(BW47:CJ47,\"ff\")+COUNTIF(CL47:CY47,\"ff\"),COUNTIF(CI35:CI48,\"ff\")+COUNTIF(CX35:CX48,\"ff\"))","v":0},13,12.991113130999999,null,13,{"$f":"IF(OR(ISERROR(FIND(\"-\",Q17)),AE17>'export html'!$AR$7),\"\",IF(LEFT(Q17,1)<>\"*\",LEFT(Q17,FIND(\"-\",Q17)-1)-0,MID(Q17,2,FIND(\"-\",Q17)-2)-0))","v":""},{"$f":"IF(OR(ISERROR(FIND(\"-\",R17)),AF17>'export html'!$AR$7),\"\",IF(LEFT(R17,1)<>\"*\",LEFT(R17,FIND(\"-\",R17)-1)-0,MID(R17,2,FIND(\"-\",R17)-2)-0))","v":""},{"$f":"IF(OR(ISERROR(FIND(\"-\",S17)),AG17>'export html'!$AR$7),\"\",IF(LEFT(S17,1)<>\"*\",LEFT(S17,FIND(\"-\",S17)-1)-0,MID(S17,2,FIND(\"-\",S17)-2)-0))","v":""},{"$f":"IF(OR(ISERROR(FIND(\"-\",T17)),AH17>'export html'!$AR$7),\"\",IF(LEFT(T17,1)<>\"*\",LEFT(T17,FIND(\"-\",T17)-1)-0,MID(T17,2,FIND(\"-\",T17)-2)-0))","v":1},{"$f":"IF(OR(ISERROR(FIND(\"-\",U17)),AI17>'export html'!$AR$7),\"\",IF(LEFT(U17,1)<>\"*\",LEFT(U17,FIND(\"-\",U17)-1)-0,MID(U17,2,FIND(\"-\",U17)-2)-0))","v":3},{"$f":"IF(OR(ISERROR(FIND(\"-\",V17)),AJ17>'export html'!$AR$7),\"\",IF(LEFT(V17,1)<>\"*\",LEFT(V17,FIND(\"-\",V17)-1)-0,MID(V17,2,FIND(\"-\",V17)-2)-0))","v":""},{"$f":"IF(OR(ISERROR(FIND(\"-\",W17)),AK17>'export html'!$AR$7),\"\",IF(LEFT(W17,1)<>\"*\",LEFT(W17,FIND(\"-\",W17)-1)-0,MID(W17,2,FIND(\"-\",W17)-2)-0))","v":""},{"$f":"IF(OR(ISERROR(FIND(\"-\",X17)),AL17>'export html'!$AR$7),\"\",IF(LEFT(X17,1)<>\"*\",LEFT(X17,FIND(\"-\",X17)-1)-0,MID(X17,2,FIND(\"-\",X17)-2)-0))","v":""},{"$f":"IF(OR(ISERROR(FIND(\"-\",Y17)),AM17>'export html'!$AR$7),\"\",IF(LEFT(Y17,1)<>\"*\",LEFT(Y17,FIND(\"-\",Y17)-1)-0,MID(Y17,2,FIND(\"-\",Y17)-2)-0))","v":""},{"$f":"IF(OR(ISERROR(FIND(\"-\",Z17)),AN17>'export html'!$AR$7),\"\",IF(LEFT(Z17,1)<>\"*\",LEFT(Z17,FIND(\"-\",Z17)-1)-0,MID(Z17,2,FIND(\"-\",Z17)-2)-0))","v":3},{"$f":"IF(OR(ISERROR(FIND(\"-\",AA17)),AO17>'export html'!$AR$7),\"\",IF(LEFT(AA17,1)<>\"*\",LEFT(AA17,FIND(\"-\",AA17)-1)-0,MID(AA17,2,FIND(\"-\",AA17)-2)-0))","v":""},{"$f":"IF(OR(ISERROR(FIND(\"-\",AB17)),AP17>'export html'!$AR$7),\"\",IF(LEFT(AB17,1)<>\"*\",LEFT(AB17,FIND(\"-\",AB17)-1)-0,MID(AB17,2,FIND(\"-\",AB17)-2)-0))","v":""},null,{"$f":"IF(OR(ISERROR(FIND(\"-\",AD17)),AR17>'export html'!$AR$7),\"\",IF(LEFT(AD17,1)<>\"*\",LEFT(AD17,FIND(\"-\",AD17)-1)-0,MID(AD17,2,FIND(\"-\",AD17)-2)-0))","v":""},13,{"$f":"IF(OR(ISERROR(FIND(\"-\",Q17)),AE17<='export html'!$AR$7),\"\",IF(LEFT(Q17,1)<>\"*\",LEFT(Q17,FIND(\"-\",Q17)-1)-0,MID(Q17,2,FIND(\"-\",Q17)-2)-0))","v":""},{"$f":"IF(OR(ISERROR(FIND(\"-\",R17)),AF17<='export html'!$AR$7),\"\",IF(LEFT(R17,1)<>\"*\",LEFT(R17,FIND(\"-\",R17)-1)-0,MID(R17,2,FIND(\"-\",R17)-2)-0))","v":""},{"$f":"IF(OR(ISERROR(FIND(\"-\",S17)),AG17<='export html'!$AR$7),\"\",IF(LEFT(S17,1)<>\"*\",LEFT(S17,FIND(\"-\",S17)-1)-0,MID(S17,2,FIND(\"-\",S17)-2)-0))","v":""},{"$f":"IF(OR(ISERROR(FIND(\"-\",T17)),AH17<='export html'!$AR$7),\"\",IF(LEFT(T17,1)<>\"*\",LEFT(T17,FIND(\"-\",T17)-1)-0,MID(T17,2,FIND(\"-\",T17)-2)-0))","v":""},{"$f":"IF(OR(ISERROR(FIND(\"-\",U17)),AI17<='export html'!$AR$7),\"\",IF(LEFT(U17,1)<>\"*\",LEFT(U17,FIND(\"-\",U17)-1)-0,MID(U17,2,FIND(\"-\",U17)-2)-0))","v":""},{"$f":"IF(OR(ISERROR(FIND(\"-\",V17)),AJ17<='export html'!$AR$7),\"\",IF(LEFT(V17,1)<>\"*\",LEFT(V17,FIND(\"-\",V17)-1)-0,MID(V17,2,FIND(\"-\",V17)-2)-0))","v":""},{"$f":"IF(OR(ISERROR(FIND(\"-\",W17)),AK17<='export html'!$AR$7),\"\",IF(LEFT(W17,1)<>\"*\",LEFT(W17,FIND(\"-\",W17)-1)-0,MID(W17,2,FIND(\"-\",W17)-2)-0))","v":""},{"$f":"IF(OR(ISERROR(FIND(\"-\",X17)),AL17<='export html'!$AR$7),\"\",IF(LEFT(X17,1)<>\"*\",LEFT(X17,FIND(\"-\",X17)-1)-0,MID(X17,2,FIND(\"-\",X17)-2)-0))","v":""},{"$f":"IF(OR(ISERROR(FIND(\"-\",Y17)),AM17<='export html'!$AR$7),\"\",IF(LEFT(Y17,1)<>\"*\",LEFT(Y17,FIND(\"-\",Y17)-1)-0,MID(Y17,2,FIND(\"-\",Y17)-2)-0))","v":""},{"$f":"IF(OR(ISERROR(FIND(\"-\",Z17)),AN17<='export html'!$AR$7),\"\",IF(LEFT(Z17,1)<>\"*\",LEFT(Z17,FIND(\"-\",Z17)-1)-0,MID(Z17,2,FIND(\"-\",Z17)-2)-0))","v":""},{"$f":"IF(OR(ISERROR(FIND(\"-\",AA17)),AO17<='export html'!$AR$7),\"\",IF(LEFT(AA17,1)<>\"*\",LEFT(AA17,FIND(\"-\",AA17)-1)-0,MID(AA17,2,FIND(\"-\",AA17)-2)-0))","v":""},{"$f":"IF(OR(ISERROR(FIND(\"-\",AB17)),AP17<='export html'!$AR$7),\"\",IF(LEFT(AB17,1)<>\"*\",LEFT(AB17,FIND(\"-\",AB17)-1)-0,MID(AB17,2,FIND(\"-\",AB17)-2)-0))","v":""},null,{"$f":"IF(OR(ISERROR(FIND(\"-\",AD17)),AR17<='export html'!$AR$7),\"\",IF(LEFT(AD17,1)<>\"*\",LEFT(AD17,FIND(\"-\",AD17)-1)-0,MID(AD17,2,FIND(\"-\",AD17)-2)-0))","v":""},13]
[null,null,14,"Jolika",0,6,"",0,6,0,2,36,-34,18,null,"Yerevan United",null,null,null,null,null,null,"9-3",null,null,null,"8-2",null,"4-1",null,17,26,15,12,21,7,3,19,24,23,1,9,5,null,"2025-01-26","2025-04-06","2025-01-12","2024-11-24","2025-02-23","2024-10-13","2024-09-15","2025-02-09","2025-03-23","2025-03-16","2024-09-01","2024-11-03","2024-09-29",null,null,3.9906020214,"Yerevan United",12,6,{"$f":"CHOOSE(StandBer,COUNTIF(BW48:CJ48,\"t\")+COUNTIF(CJ35:CJ48,\"u\")+COUNTIF(CL48:CY48,\"t\")+COUNTIF(CY35:CY48,\"u\"),COUNTIF(BW48:CJ48,\"t\")+COUNTIF(CJ35:CJ48,\"u\"),COUNTIF(CL48:CY48,\"t\")+COUNTIF(CY35:CY48,\"u\"),COUNTIF(BW48:CJ48,\"t\")+COUNTIF(CL48:CY48,\"t\"),COUNTIF(CJ35:CJ48,\"u\")+COUNTIF(CY35:CY48,\"u\"))","v":3},{"$f":"CHOOSE(StandBer,COUNTIF(BW48:CJ48,\"u\")+COUNTIF(CJ35:CJ48,\"t\")+COUNTIF(CL48:CY48,\"u\")+COUNTIF(CY35:CY48,\"t\"),COUNTIF(BW48:CJ48,\"u\")+COUNTIF(CJ35:CJ48,\"t\"),COUNTIF(CL48:CY48,\"u\")+COUNTIF(CY35:CY48,\"t\"),COUNTIF(BW48:CJ48,\"u\")+COUNTIF(CL48:CY48,\"u\"),COUNTIF(CJ35:CJ48,\"t\")+COUNTIF(CY35:CY48,\"t\"))+BR18","v":0},{"$f":"CHOOSE(StandBer,COUNTIF(BW48:CJ48,\"g\")+COUNTIF(CJ35:CJ48,\"g\")+COUNTIF(CL48:CY48,\"g\")+COUNTIF(CY35:CY48,\"g\"),COUNTIF(BW48:CJ48,\"g\")+COUNTIF(CJ35:CJ48,\"g\"),COUNTIF(CL48:CY48,\"g\")+COUNTIF(CY35:CY48,\"g\"),COUNTIF(BW48:CJ48,\"g\")+COUNTIF(CL48:CY48,\"g\"),COUNTIF(CJ35:CJ48,\"g\")+COUNTIF(CY35:CY48,\"g\"))","v":3},{"$f":"CHOOSE(StandBer,SUM(BW18:CJ18)+SUM(CJ20:CJ33)+SUM(CL18:CY18)+SUM(CY20:CY33),SUM(BW18:CJ18)+SUM(CJ20:CJ33),SUM(CL18:CY18)+SUM(CY20:CY33),SUM(BW18:CJ18)+SUM(CL18:CY18),SUM(CJ20:CJ33)+SUM(CY20:CY33))-5*BR18","v":28},{"$f":"CHOOSE(StandBer,SUM(CJ5:CJ18)+SUM(BW33:CJ33)+SUM(CY5:CY18)+SUM(CL33:CY33),SUM(CJ5:CJ18)+SUM(BW33:CJ33),SUM(CY5:CY18)+SUM(CL33:CY33),SUM(CJ5:CJ18)+SUM(CY5:CY18),SUM(BW33:CJ33)+SUM(CL33:CY33))","v":13},15,{"$f":"CHOOSE(StandBer,COUNTIF(BW48:CJ48,\"ff\")+COUNTIF(CJ35:CJ48,\"ff\")+COUNTIF(CL48:CY48,\"ff\")+COUNTIF(CY35:CY48,\"ff\"),COUNTIF(BW48:CJ48,\"ff\")+COUNTIF(CJ35:CJ48,\"ff\"),COUNTIF(CL48:CY48,\"ff\")+COUNTIF(CY35:CY48,\"ff\"),COUNTIF(BW48:CJ48,\"ff\")+COUNTIF(CL48:CY48,\"ff\"),COUNTIF(CJ35:CJ48,\"ff\")+COUNTIF(CY35:CY48,\"ff\"))","v":0},14,13.9914141409,null,14,{"$f":"IF(OR(ISERROR(FIND(\"-\",Q18)),AE18>'export html'!$AR$7),\"\",IF(LEFT(Q18,1)<>\"*\",LEFT(Q18,FIND(\"-\",Q18)-1)-0,MID(Q18,2,FIND(\"-\",Q18)-2)-0))","v":""},{"$f":"IF(OR(ISERROR(FIND(\"-\",R18)),AF18>'export html'!$AR$7),\"\",IF(LEFT(R18,1)<>\"*\",LEFT(R18,FIND(\"-\",R18)-1)-0,MID(R18,2,FIND(\"-\",R18)-2)-0))","v":""},{"$f":"IF(OR(ISERROR(FIND(\"-\",S18)),AG18>'export html'!$AR$7),\"\",IF(LEFT(S18,1)<>\"*\",LEFT(S18,FIND(\"-\",S18)-1)-0,MID(S18,2,FIND(\"-\",S18)-2)-0))","v":""},{"$f":"IF(OR(ISERROR(FIND(\"-\",T18)),AH18>'export html'!$AR$7),\"\",IF(LEFT(T18,1)<>\"*\",LEFT(T18,FIND(\"-\",T18)-1)-0,MID(T18,2,FIND(\"-\",T18)-2)-0))","v":""},{"$f":"IF(OR(ISERROR(FIND(\"-\",U18)),AI18>'export html'!$AR$7),\"\",IF(LEFT(U18,1)<>\"*\",LEFT(U18,FIND(\"-\",U18)-1)-0,MID(U18,2,FIND(\"-\",U18)-2)-0))","v":""},{"$f":"IF(OR(ISERROR(FIND(\"-\",V18)),AJ18>'export html'!$AR$7),\"\",IF(LEFT(V18,1)<>\"*\",LEFT(V18,FIND(\"-\",V18)-1)-0,MID(V18,2,FIND(\"-\",V18)-2)-0))","v":""},{"$f":"IF(OR(ISERROR(FIND(\"-\",W18)),AK18>'export html'!$AR$7),\"\",IF(LEFT(W18,1)<>\"*\",LEFT(W18,FIND(\"-\",W18)-1)-0,MID(W18,2,FIND(\"-\",W18)-2)-0))","v":9},{"$f":"IF(OR(ISERROR(FIND(\"-\",X18)),AL18>'export html'!$AR$7),\"\",IF(LEFT(X18,1)<>\"*\",LEFT(X18,FIND(\"-\",X18)-1)-0,MID(X18,2,FIND(\"-\",X18)-2)-0))","v":""},{"$f":"IF(OR(ISERROR(FIND(\"-\",Y18)),AM18>'export html'!$AR$7),\"\",IF(LEFT(Y18,1)<>\"*\",LEFT(Y18,FIND(\"-\",Y18)-1)-0,MID(Y18,2,FIND(\"-\",Y18)-2)-0))","v":""},{"$f":"IF(OR(ISERROR(FIND(\"-\",Z18)),AN18>'export html'!$AR$7),\"\",IF(LEFT(Z18,1)<>\"*\",LEFT(Z18,FIND(\"-\",Z18)-1)-0,MID(Z18,2,FIND(\"-\",Z18)-2)-0))","v":""},{"$f":"IF(OR(ISERROR(FIND(\"-\",AA18)),AO18>'export html'!$AR$7),\"\",IF(LEFT(AA18,1)<>\"*\",LEFT(AA18,FIND(\"-\",AA18)-1)-0,MID(AA18,2,FIND(\"-\",AA18)-2)-0))","v":8},{"$f":"IF(OR(ISERROR(FIND(\"-\",AB18)),AP18>'export html'!$AR$7),\"\",IF(LEFT(AB18,1)<>\"*\",LEFT(AB18,FIND(\"-\",AB18)-1)-0,MID(AB18,2,FIND(\"-\",AB18)-2)-0))","v":""},{"$f":"IF(OR(ISERROR(FIND(\"-\",AC18)),AQ18>'export html'!$AR$7),\"\",IF(LEFT(AC18,1)<>\"*\",LEFT(AC18,FIND(\"-\",AC18)-1)-0,MID(AC18,2,FIND(\"-\",AC18)-2)-0))","v":4},null,14,{"$f":"IF(OR(ISERROR(FIND(\"-\",Q18)),AE18<='export html'!$AR$7),\"\",IF(LEFT(Q18,1)<>\"*\",LEFT(Q18,FIND(\"-\",Q18)-1)-0,MID(Q18,2,FIND(\"-\",Q18)-2)-0))","v":""},{"$f":"IF(OR(ISERROR(FIND(\"-\",R18)),AF18<='export html'!$AR$7),\"\",IF(LEFT(R18,1)<>\"*\",LEFT(R18,FIND(\"-\",R18)-1)-0,MID(R18,2,FIND(\"-\",R18)-2)-0))","v":""},{"$f":"IF(OR(ISERROR(FIND(\"-\",S18)),AG18<='export html'!$AR$7),\"\",IF(LEFT(S18,1)<>\"*\",LEFT(S18,FIND(\"-\",S18)-1)-0,MID(S18,2,FIND(\"-\",S18)-2)-0))","v":""},{"$f":"IF(OR(ISERROR(FIND(\"-\",T18)),AH18<='export html'!$AR$7),\"\",IF(LEFT(T18,1)<>\"*\",LEFT(T18,FIND(\"-\",T18)-1)-0,MID(T18,2,FIND(\"-\",T18)-2)-0))","v":""},{"$f":"IF(OR(ISERROR(FIND(\"-\",U18)),AI18<='export html'!$AR$7),\"\",IF(LEFT(U18,1)<>\"*\",LEFT(U18,FIND(\"-\",U18)-1)-0,MID(U18,2,FIND(\"-\",U18)-2)-0))","v":""},{"$f":"IF(OR(ISERROR(FIND(\"-\",V18)),AJ18<='export html'!$AR$7),\"\",IF(LEFT(V18,1)<>\"*\",LEFT(V18,FIND(\"-\",V18)-1)-0,MID(V18,2,FIND(\"-\",V18)-2)-0))","v":""},{"$f":"IF(OR(ISERROR(FIND(\"-\",W18)),AK18<='export html'!$AR$7),\"\",IF(LEFT(W18,1)<>\"*\",LEFT(W18,FIND(\"-\",W18)-1)-0,MID(W18,2,FIND(\"-\",W18)-2)-0))","v":""},{"$f":"IF(OR(ISERROR(FIND(\"-\",X18)),AL18<='export html'!$AR$7),\"\",IF(LEFT(X18,1)<>\"*\",LEFT(X18,FIND(\"-\",X18)-1)-0,MID(X18,2,FIND(\"-\",X18)-2)-0))","v":""},{"$f":"IF(OR(ISERROR(FIND(\"-\",Y18)),AM18<='export html'!$AR$7),\"\",IF(LEFT(Y18,1)<>\"*\",LEFT(Y18,FIND(\"-\",Y18)-1)-0,MID(Y18,2,FIND(\"-\",Y18)-2)-0))","v":""},{"$f":"IF(OR(ISERROR(FIND(\"-\",Z18)),AN18<='export html'!$AR$7),\"\",IF(LEFT(Z18,1)<>\"*\",LEFT(Z18,FIND(\"-\",Z18)-1)-0,MID(Z18,2,FIND(\"-\",Z18)-2)-0))","v":""},{"$f":"IF(OR(ISERROR(FIND(\"-\",AA18)),AO18<='export html'!$AR$7),\"\",IF(LEFT(AA18,1)<>\"*\",LEFT(AA18,FIND(\"-\",AA18)-1)-0,MID(AA18,2,FIND(\"-\",AA18)-2)-0))","v":""},{"$f":"IF(OR(ISERROR(FIND(\"-\",AB18)),AP18<='export html'!$AR$7),\"\",IF(LEFT(AB18,1)<>\"*\",LEFT(AB18,FIND(\"-\",AB18)-1)-0,MID(AB18,2,FIND(\"-\",AB18)-2)-0))","v":""},{"$f":"IF(OR(ISERROR(FIND(\"-\",AC18)),AQ18<='export html'!$AR$7),\"\",IF(LEFT(AC18,1)<>\"*\",LEFT(AC18,FIND(\"-\",AC18)-1)-0,MID(AC18,2,FIND(\"-\",AC18)-2)-0))","v":""},null,14]
[null,null,null,null,null,null,null,null,null,null,null,null,null,null,null,null,null,"* regeling forfaits",null,null,null,null,null,null,null,null,null,null,null,null,null,null,null,null,null,null,null,null,null,null,null,null,null,null,null,null,null,null,null,null,null,null,null,null,null,null,null,null,null,null,null,null,null,null,null,null,null,null,null,null,null,null,null,null,1,2,3,4,5,6,7,8,9,10,11,12,13,14,null,1,2,3,4,5,6,7,8,9,10,11,12,13,14]
[null,null,null,null,null,null,null,null,null,null,null,null,null,null,null,null,null,null,null,null,null,null,null,null,null,null,null,null,null,null,null,null,null,null,null,null,null,null,null,null,null,null,null,null,null,null,null,null,null,null,null,null,null,null,null,null,null,null,null,null,null,null,null,null,null,null,null,null,null,null,null,null,null,1,null,{"$f":"IF(OR(ISERROR(FIND(\"-\",R5)),AF5>'export html'!$AR$7),\"\",IF(RIGHT(R5)<>\"*\",MID(R5,FIND(\"-\",R5)+1,LEN(R5)-FIND(\"-\",R5))-0,MID(R5,FIND(\"-\",R5)+1,LEN(R5)-FIND(\"-\",R5)-1)-0))","v":0},{"$f":"IF(OR(ISERROR(FIND(\"-\",S5)),AG5>'export html'!$AR$7),\"\",IF(RIGHT(S5)<>\"*\",MID(S5,FIND(\"-\",S5)+1,LEN(S5)-FIND(\"-\",S5))-0,MID(S5,FIND(\"-\",S5)+1,LEN(S5)-FIND(\"-\",S5)-1)-0))","v":""},{"$f":"IF(OR(ISERROR(FIND(\"-\",T5)),AH5>'export html'!$AR$7),\"\",IF(RIGHT(T5)<>\"*\",MID(T5,FIND(\"-\",T5)+1,LEN(T5)-FIND(\"-\",T5))-0,MID(T5,FIND(\"-\",T5)+1,LEN(T5)-FIND(\"-\",T5)-1)-0))","v":""},{"$f":"IF(OR(ISERROR(FIND(\"-\",U5)),AI5>'export html'!$AR$7),\"\",IF(RIGHT(U5)<>\"*\",MID(U5,FIND(\"-\",U5)+1,LEN(U5)-FIND(\"-\",U5))-0,MID(U5,FIND(\"-\",U5)+1,LEN(U5)-FIND(\"-\",U5)-1)-0))","v":""},{"$f":"IF(OR(ISERROR(FIND(\"-\",V5)),AJ5>'export html'!$AR$7),\"\",IF(RIGHT(V5)<>\"*\",MID(V5,FIND(\"-\",V5)+1,LEN(V5)-FIND(\"-\",V5))-0,MID(V5,FIND(\"-\",V5)+1,LEN(V5)-FIND(\"-\",V5)-1)-0))","v":""},{"$f":"IF(OR(ISERROR(FIND(\"-\",W5)),AK5>'export html'!$AR$7),\"\",IF(RIGHT(W5)<>\"*\",MID(W5,FIND(\"-\",W5)+1,LEN(W5)-FIND(\"-\",W5))-0,MID(W5,FIND(\"-\",W5)+1,LEN(W5)-FIND(\"-\",W5)-1)-0))","v":""},{"$f":"IF(OR(ISERROR(FIND(\"-\",X5)),AL5>'export html'!$AR$7),\"\",IF(RIGHT(X5)<>\"*\",MID(X5,FIND(\"-\",X5)+1,LEN(X5)-FIND(\"-\",X5))-0,MID(X5,FIND(\"-\",X5)+1,LEN(X5)-FIND(\"-\",X5)-1)-0))","v":""},{"$f":"IF(OR(ISERROR(FIND(\"-\",Y5)),AM5>'export html'!$AR$7),\"\",IF(RIGHT(Y5)<>\"*\",MID(Y5,FIND(\"-\",Y5)+1,LEN(Y5)-FIND(\"-\",Y5))-0,MID(Y5,FIND(\"-\",Y5)+1,LEN(Y5)-FIND(\"-\",Y5)-1)-0))","v":""},{"$f":"IF(OR(ISERROR(FIND(\"-\",Z5)),AN5>'export html'!$AR$7),\"\",IF(RIGHT(Z5)<>\"*\",MID(Z5,FIND(\"-\",Z5)+1,LEN(Z5)-FIND(\"-\",Z5))-0,MID(Z5,FIND(\"-\",Z5)+1,LEN(Z5)-FIND(\"-\",Z5)-1)-0))","v":""},{"$f":"IF(OR(ISERROR(FIND(\"-\",AA5)),AO5>'export html'!$AR$7),\"\",IF(RIGHT(AA5)<>\"*\",MID(AA5,FIND(\"-\",AA5)+1,LEN(AA5)-FIND(\"-\",AA5))-0,MID(AA5,FIND(\"-\",AA5)+1,LEN(AA5)-FIND(\"-\",AA5)-1)-0))","v":""},{"$f":"IF(OR(ISERROR(FIND(\"-\",AB5)),AP5>'export html'!$AR$7),\"\",IF(RIGHT(AB5)<>\"*\",MID(AB5,FIND(\"-\",AB5)+1,LEN(AB5)-FIND(\"-\",AB5))-0,MID(AB5,FIND(\"-\",AB5)+1,LEN(AB5)-FIND(\"-\",AB5)-1)-0))","v":0},{"$f":"IF(OR(ISERROR(FIND(\"-\",AC5)),AQ5>'export html'!$AR$7),\"\",IF(RIGHT(AC5)<>\"*\",MID(AC5,FIND(\"-\",AC5)+1,LEN(AC5)-FIND(\"-\",AC5))-0,MID(AC5,FIND(\"-\",AC5)+1,LEN(AC5)-FIND(\"-\",AC5)-1)-0))","v":""},{"$f":"IF(OR(ISERROR(FIND(\"-\",AD5)),AR5>'export html'!$AR$7),\"\",IF(RIGHT(AD5)<>\"*\",MID(AD5,FIND(\"-\",AD5)+1,LEN(AD5)-FIND(\"-\",AD5))-0,MID(AD5,FIND(\"-\",AD5)+1,LEN(AD5)-FIND(\"-\",AD5)-1)-0))","v":2},1,null,{"$f":"IF(OR(ISERROR(FIND(\"-\",R5)),AF5<='export html'!$AR$7),\"\",IF(RIGHT(R5)<>\"*\",MID(R5,FIND(\"-\",R5)+1,LEN(R5)-FIND(\"-\",R5))-0,MID(R5,FIND(\"-\",R5)+1,LEN(R5)-FIND(\"-\",R5)-1)-0))","v":""},{"$f":"IF(OR(ISERROR(FIND(\"-\",S5)),AG5<='export html'!$AR$7),\"\",IF(RIGHT(S5)<>\"*\",MID(S5,FIND(\"-\",S5)+1,LEN(S5)-FIND(\"-\",S5))-0,MID(S5,FIND(\"-\",S5)+1,LEN(S5)-FIND(\"-\",S5)-1)-0))","v":""},{"$f":"IF(OR(ISERROR(FIND(\"-\",T5)),AH5<='export html'!$AR$7),\"\",IF(RIGHT(T5)<>\"*\",MID(T5,FIND(\"-\",T5)+1,LEN(T5)-FIND(\"-\",T5))-0,MID(T5,FIND(\"-\",T5)+1,LEN(T5)-FIND(\"-\",T5)-1)-0))","v":""},{"$f":"IF(OR(ISERROR(FIND(\"-\",U5)),AI5<='export html'!$AR$7),\"\",IF(RIGHT(U5)<>\"*\",MID(U5,FIND(\"-\",U5)+1,LEN(U5)-FIND(\"-\",U5))-0,MID(U5,FIND(\"-\",U5)+1,LEN(U5)-FIND(\"-\",U5)-1)-0))","v":""},{"$f":"IF(OR(ISERROR(FIND(\"-\",V5)),AJ5<='export html'!$AR$7),\"\",IF(RIGHT(V5)<>\"*\",MID(V5,FIND(\"-\",V5)+1,LEN(V5)-FIND(\"-\",V5))-0,MID(V5,FIND(\"-\",V5)+1,LEN(V5)-FIND(\"-\",V5)-1)-0))","v":""},{"$f":"IF(OR(ISERROR(FIND(\"-\",W5)),AK5<='export html'!$AR$7),\"\",IF(RIGHT(W5)<>\"*\",MID(W5,FIND(\"-\",W5)+1,LEN(W5)-FIND(\"-\",W5))-0,MID(W5,FIND(\"-\",W5)+1,LEN(W5)-FIND(\"-\",W5)-1)-0))","v":""},{"$f":"IF(OR(ISERROR(FIND(\"-\",X5)),AL5<='export html'!$AR$7),\"\",IF(RIGHT(X5)<>\"*\",MID(X5,FIND(\"-\",X5)+1,LEN(X5)-FIND(\"-\",X5))-0,MID(X5,FIND(\"-\",X5)+1,LEN(X5)-FIND(\"-\",X5)-1)-0))","v":""},{"$f":"IF(OR(ISERROR(FIND(\"-\",Y5)),AM5<='export html'!$AR$7),\"\",IF(RIGHT(Y5)<>\"*\",MID(Y5,FIND(\"-\",Y5)+1,LEN(Y5)-FIND(\"-\",Y5))-0,MID(Y5,FIND(\"-\",Y5)+1,LEN(Y5)-FIND(\"-\",Y5)-1)-0))","v":""},{"$f":"IF(OR(ISERROR(FIND(\"-\",Z5)),AN5<='export html'!$AR$7),\"\",IF(RIGHT(Z5)<>\"*\",MID(Z5,FIND(\"-\",Z5)+1,LEN(Z5)-FIND(\"-\",Z5))-0,MID(Z5,FIND(\"-\",Z5)+1,LEN(Z5)-FIND(\"-\",Z5)-1)-0))","v":""},{"$f":"IF(OR(ISERROR(FIND(\"-\",AA5)),AO5<='export html'!$AR$7),\"\",IF(RIGHT(AA5)<>\"*\",MID(AA5,FIND(\"-\",AA5)+1,LEN(AA5)-FIND(\"-\",AA5))-0,MID(AA5,FIND(\"-\",AA5)+1,LEN(AA5)-FIND(\"-\",AA5)-1)-0))","v":""},{"$f":"IF(OR(ISERROR(FIND(\"-\",AB5)),AP5<='export html'!$AR$7),\"\",IF(RIGHT(AB5)<>\"*\",MID(AB5,FIND(\"-\",AB5)+1,LEN(AB5)-FIND(\"-\",AB5))-0,MID(AB5,FIND(\"-\",AB5)+1,LEN(AB5)-FIND(\"-\",AB5)-1)-0))","v":""},{"$f":"IF(OR(ISERROR(FIND(\"-\",AC5)),AQ5<='export html'!$AR$7),\"\",IF(RIGHT(AC5)<>\"*\",MID(AC5,FIND(\"-\",AC5)+1,LEN(AC5)-FIND(\"-\",AC5))-0,MID(AC5,FIND(\"-\",AC5)+1,LEN(AC5)-FIND(\"-\",AC5)-1)-0))","v":""},{"$f":"IF(OR(ISERROR(FIND(\"-\",AD5)),AR5<='export html'!$AR$7),\"\",IF(RIGHT(AD5)<>\"*\",MID(AD5,FIND(\"-\",AD5)+1,LEN(AD5)-FIND(\"-\",AD5))-0,MID(AD5,FIND(\"-\",AD5)+1,LEN(AD5)-FIND(\"-\",AD5)-1)-0))","v":""},1]
[null,null,null,null,{"$f":"'export html'!V1","v":"Recentste duels op "},"2024-10-08",null,null,null,null,null,null,null,null,null,null,"Topschutters:",null,null,{"$f":"\"(na \" & SUM(spelersstatistieken!AM1) & \" match\" & IF(SUM(spelersstatistieken!AM1) = 1, \"\", \"en\" ) & \")\"","v":"(na 6 matchen)"},null,null,null,null,null,"Man van het Seizoen:",null,null,null,{"$f":"\"(na \" & COUNTIF( spelersstatistieken!AP47:BO47, \">0\" ) & \" match\" & IF( COUNTIF( spelersstatistieken!AP47:BO47, \">0\" ) = 1, \"\", \"en\" ) & \")\"","v":"(na 6 matchen)"},null,null,null,null,null,null,null,null,null,null,null,null,null,null,null,null,null,null,null,null,null,null,null,null,null,null,null,null,null,null,null,null,null,null,null,null,null,null,null,null,null,null,null,2,{"$f":"IF(OR(ISERROR(FIND(\"-\",Q6)),AE6>'export html'!$AR$7),\"\",IF(RIGHT(Q6)<>\"*\",MID(Q6,FIND(\"-\",Q6)+1,LEN(Q6)-FIND(\"-\",Q6))-0,MID(Q6,FIND(\"-\",Q6)+1,LEN(Q6)-FIND(\"-\",Q6)-1)-0))","v":""},null,{"$f":"IF(OR(ISERROR(FIND(\"-\",S6)),AG6>'export html'!$AR$7),\"\",IF(RIGHT(S6)<>\"*\",MID(S6,FIND(\"-\",S6)+1,LEN(S6)-FIND(\"-\",S6))-0,MID(S6,FIND(\"-\",S6)+1,LEN(S6)-FIND(\"-\",S6)-1)-0))","v":""},{"$f":"IF(OR(ISERROR(FIND(\"-\",T6)),AH6>'export html'!$AR$7),\"\",IF(RIGHT(T6)<>\"*\",MID(T6,FIND(\"-\",T6)+1,LEN(T6)-FIND(\"-\",T6))-0,MID(T6,FIND(\"-\",T6)+1,LEN(T6)-FIND(\"-\",T6)-1)-0))","v":""},{"$f":"IF(OR(ISERROR(FIND(\"-\",U6)),AI6>'export html'!$AR$7),\"\",IF(RIGHT(U6)<>\"*\",MID(U6,FIND(\"-\",U6)+1,LEN(U6)-FIND(\"-\",U6))-0,MID(U6,FIND(\"-\",U6)+1,LEN(U6)-FIND(\"-\",U6)-1)-0))","v":""},{"$f":"IF(OR(ISERROR(FIND(\"-\",V6)),AJ6>'export html'!$AR$7),\"\",IF(RIGHT(V6)<>\"*\",MID(V6,FIND(\"-\",V6)+1,LEN(V6)-FIND(\"-\",V6))-0,MID(V6,FIND(\"-\",V6)+1,LEN(V6)-FIND(\"-\",V6)-1)-0))","v":""},{"$f":"IF(OR(ISERROR(FIND(\"-\",W6)),AK6>'export html'!$AR$7),\"\",IF(RIGHT(W6)<>\"*\",MID(W6,FIND(\"-\",W6)+1,LEN(W6)-FIND(\"-\",W6))-0,MID(W6,FIND(\"-\",W6)+1,LEN(W6)-FIND(\"-\",W6)-1)-0))","v":1},{"$f":"IF(OR(ISERROR(FIND(\"-\",X6)),AL6>'export html'!$AR$7),\"\",IF(RIGHT(X6)<>\"*\",MID(X6,FIND(\"-\",X6)+1,LEN(X6)-FIND(\"-\",X6))-0,MID(X6,FIND(\"-\",X6)+1,LEN(X6)-FIND(\"-\",X6)-1)-0))","v":""},{"$f":"IF(OR(ISERROR(FIND(\"-\",Y6)),AM6>'export html'!$AR$7),\"\",IF(RIGHT(Y6)<>\"*\",MID(Y6,FIND(\"-\",Y6)+1,LEN(Y6)-FIND(\"-\",Y6))-0,MID(Y6,FIND(\"-\",Y6)+1,LEN(Y6)-FIND(\"-\",Y6)-1)-0))","v":0},{"$f":"IF(OR(ISERROR(FIND(\"-\",Z6)),AN6>'export html'!$AR$7),\"\",IF(RIGHT(Z6)<>\"*\",MID(Z6,FIND(\"-\",Z6)+1,LEN(Z6)-FIND(\"-\",Z6))-0,MID(Z6,FIND(\"-\",Z6)+1,LEN(Z6)-FIND(\"-\",Z6)-1)-0))","v":""},{"$f":"IF(OR(ISERROR(FIND(\"-\",AA6)),AO6>'export html'!$AR$7),\"\",IF(RIGHT(AA6)<>\"*\",MID(AA6,FIND(\"-\",AA6)+1,LEN(AA6)-FIND(\"-\",AA6))-0,MID(AA6,FIND(\"-\",AA6)+1,LEN(AA6)-FIND(\"-\",AA6)-1)-0))","v":3},{"$f":"IF(OR(ISERROR(FIND(\"-\",AB6)),AP6>'export html'!$AR$7),\"\",IF(RIGHT(AB6)<>\"*\",MID(AB6,FIND(\"-\",AB6)+1,LEN(AB6)-FIND(\"-\",AB6))-0,MID(AB6,FIND(\"-\",AB6)+1,LEN(AB6)-FIND(\"-\",AB6)-1)-0))","v":""},{"$f":"IF(OR(ISERROR(FIND(\"-\",AC6)),AQ6>'export html'!$AR$7),\"\",IF(RIGHT(AC6)<>\"*\",MID(AC6,FIND(\"-\",AC6)+1,LEN(AC6)-FIND(\"-\",AC6))-0,MID(AC6,FIND(\"-\",AC6)+1,LEN(AC6)-FIND(\"-\",AC6)-1)-0))","v":""},{"$f":"IF(OR(ISERROR(FIND(\"-\",AD6)),AR6>'export html'!$AR$7),\"\",IF(RIGHT(AD6)<>\"*\",MID(AD6,FIND(\"-\",AD6)+1,LEN(AD6)-FIND(\"-\",AD6))-0,MID(AD6,FIND(\"-\",AD6)+1,LEN(AD6)-FIND(\"-\",AD6)-1)-0))","v":""},2,{"$f":"IF(OR(ISERROR(FIND(\"-\",Q6)),AE6<='export html'!$AR$7),\"\",IF(RIGHT(Q6)<>\"*\",MID(Q6,FIND(\"-\",Q6)+1,LEN(Q6)-FIND(\"-\",Q6))-0,MID(Q6,FIND(\"-\",Q6)+1,LEN(Q6)-FIND(\"-\",Q6)-1)-0))","v":""},null,{"$f":"IF(OR(ISERROR(FIND(\"-\",S6)),AG6<='export html'!$AR$7),\"\",IF(RIGHT(S6)<>\"*\",MID(S6,FIND(\"-\",S6)+1,LEN(S6)-FIND(\"-\",S6))-0,MID(S6,FIND(\"-\",S6)+1,LEN(S6)-FIND(\"-\",S6)-1)-0))","v":""},{"$f":"IF(OR(ISERROR(FIND(\"-\",T6)),AH6<='export html'!$AR$7),\"\",IF(RIGHT(T6)<>\"*\",MID(T6,FIND(\"-\",T6)+1,LEN(T6)-FIND(\"-\",T6))-0,MID(T6,FIND(\"-\",T6)+1,LEN(T6)-FIND(\"-\",T6)-1)-0))","v":""},{"$f":"IF(OR(ISERROR(FIND(\"-\",U6)),AI6<='export html'!$AR$7),\"\",IF(RIGHT(U6)<>\"*\",MID(U6,FIND(\"-\",U6)+1,LEN(U6)-FIND(\"-\",U6))-0,MID(U6,FIND(\"-\",U6)+1,LEN(U6)-FIND(\"-\",U6)-1)-0))","v":""},{"$f":"IF(OR(ISERROR(FIND(\"-\",V6)),AJ6<='export html'!$AR$7),\"\",IF(RIGHT(V6)<>\"*\",MID(V6,FIND(\"-\",V6)+1,LEN(V6)-FIND(\"-\",V6))-0,MID(V6,FIND(\"-\",V6)+1,LEN(V6)-FIND(\"-\",V6)-1)-0))","v":""},{"$f":"IF(OR(ISERROR(FIND(\"-\",W6)),AK6<='export html'!$AR$7),\"\",IF(RIGHT(W6)<>\"*\",MID(W6,FIND(\"-\",W6)+1,LEN(W6)-FIND(\"-\",W6))-0,MID(W6,FIND(\"-\",W6)+1,LEN(W6)-FIND(\"-\",W6)-1)-0))","v":""},{"$f":"IF(OR(ISERROR(FIND(\"-\",X6)),AL6<='export html'!$AR$7),\"\",IF(RIGHT(X6)<>\"*\",MID(X6,FIND(\"-\",X6)+1,LEN(X6)-FIND(\"-\",X6))-0,MID(X6,FIND(\"-\",X6)+1,LEN(X6)-FIND(\"-\",X6)-1)-0))","v":""},{"$f":"IF(OR(ISERROR(FIND(\"-\",Y6)),AM6<='export html'!$AR$7),\"\",IF(RIGHT(Y6)<>\"*\",MID(Y6,FIND(\"-\",Y6)+1,LEN(Y6)-FIND(\"-\",Y6))-0,MID(Y6,FIND(\"-\",Y6)+1,LEN(Y6)-FIND(\"-\",Y6)-1)-0))","v":""},{"$f":"IF(OR(ISERROR(FIND(\"-\",Z6)),AN6<='export html'!$AR$7),\"\",IF(RIGHT(Z6)<>\"*\",MID(Z6,FIND(\"-\",Z6)+1,LEN(Z6)-FIND(\"-\",Z6))-0,MID(Z6,FIND(\"-\",Z6)+1,LEN(Z6)-FIND(\"-\",Z6)-1)-0))","v":""},{"$f":"IF(OR(ISERROR(FIND(\"-\",AA6)),AO6<='export html'!$AR$7),\"\",IF(RIGHT(AA6)<>\"*\",MID(AA6,FIND(\"-\",AA6)+1,LEN(AA6)-FIND(\"-\",AA6))-0,MID(AA6,FIND(\"-\",AA6)+1,LEN(AA6)-FIND(\"-\",AA6)-1)-0))","v":""},{"$f":"IF(OR(ISERROR(FIND(\"-\",AB6)),AP6<='export html'!$AR$7),\"\",IF(RIGHT(AB6)<>\"*\",MID(AB6,FIND(\"-\",AB6)+1,LEN(AB6)-FIND(\"-\",AB6))-0,MID(AB6,FIND(\"-\",AB6)+1,LEN(AB6)-FIND(\"-\",AB6)-1)-0))","v":""},{"$f":"IF(OR(ISERROR(FIND(\"-\",AC6)),AQ6<='export html'!$AR$7),\"\",IF(RIGHT(AC6)<>\"*\",MID(AC6,FIND(\"-\",AC6)+1,LEN(AC6)-FIND(\"-\",AC6))-0,MID(AC6,FIND(\"-\",AC6)+1,LEN(AC6)-FIND(\"-\",AC6)-1)-0))","v":""},{"$f":"IF(OR(ISERROR(FIND(\"-\",AD6)),AR6<='export html'!$AR$7),\"\",IF(RIGHT(AD6)<>\"*\",MID(AD6,FIND(\"-\",AD6)+1,LEN(AD6)-FIND(\"-\",AD6))-0,MID(AD6,FIND(\"-\",AD6)+1,LEN(AD6)-FIND(\"-\",AD6)-1)-0))","v":""},2]
[null,null,null,null,null,null,null,null,null,null,null,null,null,null,null,null,null,null,null,null,null,null,null,null,null,null,null,null,null,null,null,null,null,null,null,null,null,null,null,null,null,null,null,null,null,null,null,null,null,null,null,null,null,null,null,null,null,null,null,null,null,null,null,null,null,null,null,null,null,null,null,null,null,3,{"$f":"IF(OR(ISERROR(FIND(\"-\",Q7)),AE7>'export html'!$AR$7),\"\",IF(RIGHT(Q7)<>\"*\",MID(Q7,FIND(\"-\",Q7)+1,LEN(Q7)-FIND(\"-\",Q7))-0,MID(Q7,FIND(\"-\",Q7)+1,LEN(Q7)-FIND(\"-\",Q7)-1)-0))","v":""},{"$f":"IF(OR(ISERROR(FIND(\"-\",R7)),AF7>'export html'!$AR$7),\"\",IF(RIGHT(R7)<>\"*\",MID(R7,FIND(\"-\",R7)+1,LEN(R7)-FIND(\"-\",R7))-0,MID(R7,FIND(\"-\",R7)+1,LEN(R7)-FIND(\"-\",R7)-1)-0))","v":2},null,{"$f":"IF(OR(ISERROR(FIND(\"-\",T7)),AH7>'export html'!$AR$7),\"\",IF(RIGHT(T7)<>\"*\",MID(T7,FIND(\"-\",T7)+1,LEN(T7)-FIND(\"-\",T7))-0,MID(T7,FIND(\"-\",T7)+1,LEN(T7)-FIND(\"-\",T7)-1)-0))","v":""},{"$f":"IF(OR(ISERROR(FIND(\"-\",U7)),AI7>'export html'!$AR$7),\"\",IF(RIGHT(U7)<>\"*\",MID(U7,FIND(\"-\",U7)+1,LEN(U7)-FIND(\"-\",U7))-0,MID(U7,FIND(\"-\",U7)+1,LEN(U7)-FIND(\"-\",U7)-1)-0))","v":""},{"$f":"IF(OR(ISERROR(FIND(\"-\",V7)),AJ7>'export html'!$AR$7),\"\",IF(RIGHT(V7)<>\"*\",MID(V7,FIND(\"-\",V7)+1,LEN(V7)-FIND(\"-\",V7))-0,MID(V7,FIND(\"-\",V7)+1,LEN(V7)-FIND(\"-\",V7)-1)-0))","v":""},{"$f":"IF(OR(ISERROR(FIND(\"-\",W7)),AK7>'export html'!$AR$7),\"\",IF(RIGHT(W7)<>\"*\",MID(W7,FIND(\"-\",W7)+1,LEN(W7)-FIND(\"-\",W7))-0,MID(W7,FIND(\"-\",W7)+1,LEN(W7)-FIND(\"-\",W7)-1)-0))","v":""},{"$f":"IF(OR(ISERROR(FIND(\"-\",X7)),AL7>'export html'!$AR$7),\"\",IF(RIGHT(X7)<>\"*\",MID(X7,FIND(\"-\",X7)+1,LEN(X7)-FIND(\"-\",X7))-0,MID(X7,FIND(\"-\",X7)+1,LEN(X7)-FIND(\"-\",X7)-1)-0))","v":""},{"$f":"IF(OR(ISERROR(FIND(\"-\",Y7)),AM7>'export html'!$AR$7),\"\",IF(RIGHT(Y7)<>\"*\",MID(Y7,FIND(\"-\",Y7)+1,LEN(Y7)-FIND(\"-\",Y7))-0,MID(Y7,FIND(\"-\",Y7)+1,LEN(Y7)-FIND(\"-\",Y7)-1)-0))","v":0},{"$f":"IF(OR(ISERROR(FIND(\"-\",Z7)),AN7>'export html'!$AR$7),\"\",IF(RIGHT(Z7)<>\"*\",MID(Z7,FIND(\"-\",Z7)+1,LEN(Z7)-FIND(\"-\",Z7))-0,MID(Z7,FIND(\"-\",Z7)+1,LEN(Z7)-FIND(\"-\",Z7)-1)-0))","v":""},{"$f":"IF(OR(ISERROR(FIND(\"-\",AA7)),AO7>'export html'!$AR$7),\"\",IF(RIGHT(AA7)<>\"*\",MID(AA7,FIND(\"-\",AA7)+1,LEN(AA7)-FIND(\"-\",AA7))-0,MID(AA7,FIND(\"-\",AA7)+1,LEN(AA7)-FIND(\"-\",AA7)-1)-0))","v":""},{"$f":"IF(OR(ISERROR(FIND(\"-\",AB7)),AP7>'export html'!$AR$7),\"\",IF(RIGHT(AB7)<>\"*\",MID(AB7,FIND(\"-\",AB7)+1,LEN(AB7)-FIND(\"-\",AB7))-0,MID(AB7,FIND(\"-\",AB7)+1,LEN(AB7)-FIND(\"-\",AB7)-1)-0))","v":""},{"$f":"IF(OR(ISERROR(FIND(\"-\",AC7)),AQ7>'export html'!$AR$7),\"\",IF(RIGHT(AC7)<>\"*\",MID(AC7,FIND(\"-\",AC7)+1,LEN(AC7)-FIND(\"-\",AC7))-0,MID(AC7,FIND(\"-\",AC7)+1,LEN(AC7)-FIND(\"-\",AC7)-1)-0))","v":""},{"$f":"IF(OR(ISERROR(FIND(\"-\",AD7)),AR7>'export html'!$AR$7),\"\",IF(RIGHT(AD7)<>\"*\",MID(AD7,FIND(\"-\",AD7)+1,LEN(AD7)-FIND(\"-\",AD7))-0,MID(AD7,FIND(\"-\",AD7)+1,LEN(AD7)-FIND(\"-\",AD7)-1)-0))","v":4},3,{"$f":"IF(OR(ISERROR(FIND(\"-\",Q7)),AE7<='export html'!$AR$7),\"\",IF(RIGHT(Q7)<>\"*\",MID(Q7,FIND(\"-\",Q7)+1,LEN(Q7)-FIND(\"-\",Q7))-0,MID(Q7,FIND(\"-\",Q7)+1,LEN(Q7)-FIND(\"-\",Q7)-1)-0))","v":""},{"$f":"IF(OR(ISERROR(FIND(\"-\",R7)),AF7<='export html'!$AR$7),\"\",IF(RIGHT(R7)<>\"*\",MID(R7,FIND(\"-\",R7)+1,LEN(R7)-FIND(\"-\",R7))-0,MID(R7,FIND(\"-\",R7)+1,LEN(R7)-FIND(\"-\",R7)-1)-0))","v":""},null,{"$f":"IF(OR(ISERROR(FIND(\"-\",T7)),AH7<='export html'!$AR$7),\"\",IF(RIGHT(T7)<>\"*\",MID(T7,FIND(\"-\",T7)+1,LEN(T7)-FIND(\"-\",T7))-0,MID(T7,FIND(\"-\",T7)+1,LEN(T7)-FIND(\"-\",T7)-1)-0))","v":""},{"$f":"IF(OR(ISERROR(FIND(\"-\",U7)),AI7<='export html'!$AR$7),\"\",IF(RIGHT(U7)<>\"*\",MID(U7,FIND(\"-\",U7)+1,LEN(U7)-FIND(\"-\",U7))-0,MID(U7,FIND(\"-\",U7)+1,LEN(U7)-FIND(\"-\",U7)-1)-0))","v":""},{"$f":"IF(OR(ISERROR(FIND(\"-\",V7)),AJ7<='export html'!$AR$7),\"\",IF(RIGHT(V7)<>\"*\",MID(V7,FIND(\"-\",V7)+1,LEN(V7)-FIND(\"-\",V7))-0,MID(V7,FIND(\"-\",V7)+1,LEN(V7)-FIND(\"-\",V7)-1)-0))","v":""},{"$f":"IF(OR(ISERROR(FIND(\"-\",W7)),AK7<='export html'!$AR$7),\"\",IF(RIGHT(W7)<>\"*\",MID(W7,FIND(\"-\",W7)+1,LEN(W7)-FIND(\"-\",W7))-0,MID(W7,FIND(\"-\",W7)+1,LEN(W7)-FIND(\"-\",W7)-1)-0))","v":""},{"$f":"IF(OR(ISERROR(FIND(\"-\",X7)),AL7<='export html'!$AR$7),\"\",IF(RIGHT(X7)<>\"*\",MID(X7,FIND(\"-\",X7)+1,LEN(X7)-FIND(\"-\",X7))-0,MID(X7,FIND(\"-\",X7)+1,LEN(X7)-FIND(\"-\",X7)-1)-0))","v":""},{"$f":"IF(OR(ISERROR(FIND(\"-\",Y7)),AM7<='export html'!$AR$7),\"\",IF(RIGHT(Y7)<>\"*\",MID(Y7,FIND(\"-\",Y7)+1,LEN(Y7)-FIND(\"-\",Y7))-0,MID(Y7,FIND(\"-\",Y7)+1,LEN(Y7)-FIND(\"-\",Y7)-1)-0))","v":""},{"$f":"IF(OR(ISERROR(FIND(\"-\",Z7)),AN7<='export html'!$AR$7),\"\",IF(RIGHT(Z7)<>\"*\",MID(Z7,FIND(\"-\",Z7)+1,LEN(Z7)-FIND(\"-\",Z7))-0,MID(Z7,FIND(\"-\",Z7)+1,LEN(Z7)-FIND(\"-\",Z7)-1)-0))","v":""},{"$f":"IF(OR(ISERROR(FIND(\"-\",AA7)),AO7<='export html'!$AR$7),\"\",IF(RIGHT(AA7)<>\"*\",MID(AA7,FIND(\"-\",AA7)+1,LEN(AA7)-FIND(\"-\",AA7))-0,MID(AA7,FIND(\"-\",AA7)+1,LEN(AA7)-FIND(\"-\",AA7)-1)-0))","v":""},{"$f":"IF(OR(ISERROR(FIND(\"-\",AB7)),AP7<='export html'!$AR$7),\"\",IF(RIGHT(AB7)<>\"*\",MID(AB7,FIND(\"-\",AB7)+1,LEN(AB7)-FIND(\"-\",AB7))-0,MID(AB7,FIND(\"-\",AB7)+1,LEN(AB7)-FIND(\"-\",AB7)-1)-0))","v":""},{"$f":"IF(OR(ISERROR(FIND(\"-\",AC7)),AQ7<='export html'!$AR$7),\"\",IF(RIGHT(AC7)<>\"*\",MID(AC7,FIND(\"-\",AC7)+1,LEN(AC7)-FIND(\"-\",AC7))-0,MID(AC7,FIND(\"-\",AC7)+1,LEN(AC7)-FIND(\"-\",AC7)-1)-0))","v":""},{"$f":"IF(OR(ISERROR(FIND(\"-\",AD7)),AR7<='export html'!$AR$7),\"\",IF(RIGHT(AD7)<>\"*\",MID(AD7,FIND(\"-\",AD7)+1,LEN(AD7)-FIND(\"-\",AD7))-0,MID(AD7,FIND(\"-\",AD7)+1,LEN(AD7)-FIND(\"-\",AD7)-1)-0))","v":""},3]
[null,null,null,{"$f":"IF('export html'!T3=\"\",\"\",'export html'!T3)","v":"2024-10-06"},{"$f":"IF('export html'!U3=\"\",\"\",'export html'!U3)","v":6},{"$f":"IF('export html'!V3=\"\",\"\",'export html'!V3)","v":"Daltons - Lucyvo"},null,null,null,null,null,null,null,{"$f":"IF('export html'!W3=\"\",\"\",'export html'!W3)","v":"3-0"},null,null,{"$f":"_xlfn.CHOOSECOLS(_xlfn.ANCHORARRAY( 'export html'!AF3), 2, 1 )","v":3},"Stijn Hofmans",null,null,null,null,null,null,null,{"$f":"_xlfn.CHOOSECOLS(_xlfn.ANCHORARRAY( spelersstatistieken!AK350), 2, 1 )","v":60.241830065359473},"Maarten Langenaeker",null,null,null,null,null,null,null,null,null,null,null,null,null,null,null,null,null,null,null,null,null,null,null,null,null,null,null,null,null,null,null,null,null,null,null,null,null,null,null,null,null,null,null,null,null,null,4,{"$f":"IF(OR(ISERROR(FIND(\"-\",Q8)),AE8>'export html'!$AR$7),\"\",IF(RIGHT(Q8)<>\"*\",MID(Q8,FIND(\"-\",Q8)+1,LEN(Q8)-FIND(\"-\",Q8))-0,MID(Q8,FIND(\"-\",Q8)+1,LEN(Q8)-FIND(\"-\",Q8)-1)-0))","v":1},{"$f":"IF(OR(ISERROR(FIND(\"-\",R8)),AF8>'export html'!$AR$7),\"\",IF(RIGHT(R8)<>\"*\",MID(R8,FIND(\"-\",R8)+1,LEN(R8)-FIND(\"-\",R8))-0,MID(R8,FIND(\"-\",R8)+1,LEN(R8)-FIND(\"-\",R8)-1)-0))","v":7},{"$f":"IF(OR(ISERROR(FIND(\"-\",S8)),AG8>'export html'!$AR$7),\"\",IF(RIGHT(S8)<>\"*\",MID(S8,FIND(\"-\",S8)+1,LEN(S8)-FIND(\"-\",S8))-0,MID(S8,FIND(\"-\",S8)+1,LEN(S8)-FIND(\"-\",S8)-1)-0))","v":7},null,{"$f":"IF(OR(ISERROR(FIND(\"-\",U8)),AI8>'export html'!$AR$7),\"\",IF(RIGHT(U8)<>\"*\",MID(U8,FIND(\"-\",U8)+1,LEN(U8)-FIND(\"-\",U8))-0,MID(U8,FIND(\"-\",U8)+1,LEN(U8)-FIND(\"-\",U8)-1)-0))","v":""},{"$f":"IF(OR(ISERROR(FIND(\"-\",V8)),AJ8>'export html'!$AR$7),\"\",IF(RIGHT(V8)<>\"*\",MID(V8,FIND(\"-\",V8)+1,LEN(V8)-FIND(\"-\",V8))-0,MID(V8,FIND(\"-\",V8)+1,LEN(V8)-FIND(\"-\",V8)-1)-0))","v":""},{"$f":"IF(OR(ISERROR(FIND(\"-\",W8)),AK8>'export html'!$AR$7),\"\",IF(RIGHT(W8)<>\"*\",MID(W8,FIND(\"-\",W8)+1,LEN(W8)-FIND(\"-\",W8))-0,MID(W8,FIND(\"-\",W8)+1,LEN(W8)-FIND(\"-\",W8)-1)-0))","v":""},{"$f":"IF(OR(ISERROR(FIND(\"-\",X8)),AL8>'export html'!$AR$7),\"\",IF(RIGHT(X8)<>\"*\",MID(X8,FIND(\"-\",X8)+1,LEN(X8)-FIND(\"-\",X8))-0,MID(X8,FIND(\"-\",X8)+1,LEN(X8)-FIND(\"-\",X8)-1)-0))","v":""},{"$f":"IF(OR(ISERROR(FIND(\"-\",Y8)),AM8>'export html'!$AR$7),\"\",IF(RIGHT(Y8)<>\"*\",MID(Y8,FIND(\"-\",Y8)+1,LEN(Y8)-FIND(\"-\",Y8))-0,MID(Y8,FIND(\"-\",Y8)+1,LEN(Y8)-FIND(\"-\",Y8)-1)-0))","v":""},{"$f":"IF(OR(ISERROR(FIND(\"-\",Z8)),AN8>'export html'!$AR$7),\"\",IF(RIGHT(Z8)<>\"*\",MID(Z8,FIND(\"-\",Z8)+1,LEN(Z8)-FIND(\"-\",Z8))-0,MID(Z8,FIND(\"-\",Z8)+1,LEN(Z8)-FIND(\"-\",Z8)-1)-0))","v":""},{"$f":"IF(OR(ISERROR(FIND(\"-\",AA8)),AO8>'export html'!$AR$7),\"\",IF(RIGHT(AA8)<>\"*\",MID(AA8,FIND(\"-\",AA8)+1,LEN(AA8)-FIND(\"-\",AA8))-0,MID(AA8,FIND(\"-\",AA8)+1,LEN(AA8)-FIND(\"-\",AA8)-1)-0))","v":""},{"$f":"IF(OR(ISERROR(FIND(\"-\",AB8)),AP8>'export html'!$AR$7),\"\",IF(RIGHT(AB8)<>\"*\",MID(AB8,FIND(\"-\",AB8)+1,LEN(AB8)-FIND(\"-\",AB8))-0,MID(AB8,FIND(\"-\",AB8)+1,LEN(AB8)-FIND(\"-\",AB8)-1)-0))","v":""},{"$f":"IF(OR(ISERROR(FIND(\"-\",AC8)),AQ8>'export html'!$AR$7),\"\",IF(RIGHT(AC8)<>\"*\",MID(AC8,FIND(\"-\",AC8)+1,LEN(AC8)-FIND(\"-\",AC8))-0,MID(AC8,FIND(\"-\",AC8)+1,LEN(AC8)-FIND(\"-\",AC8)-1)-0))","v":""},{"$f":"IF(OR(ISERROR(FIND(\"-\",AD8)),AR8>'export html'!$AR$7),\"\",IF(RIGHT(AD8)<>\"*\",MID(AD8,FIND(\"-\",AD8)+1,LEN(AD8)-FIND(\"-\",AD8))-0,MID(AD8,FIND(\"-\",AD8)+1,LEN(AD8)-FIND(\"-\",AD8)-1)-0))","v":""},4,{"$f":"IF(OR(ISERROR(FIND(\"-\",Q8)),AE8<='export html'!$AR$7),\"\",IF(RIGHT(Q8)<>\"*\",MID(Q8,FIND(\"-\",Q8)+1,LEN(Q8)-FIND(\"-\",Q8))-0,MID(Q8,FIND(\"-\",Q8)+1,LEN(Q8)-FIND(\"-\",Q8)-1)-0))","v":""},{"$f":"IF(OR(ISERROR(FIND(\"-\",R8)),AF8<='export html'!$AR$7),\"\",IF(RIGHT(R8)<>\"*\",MID(R8,FIND(\"-\",R8)+1,LEN(R8)-FIND(\"-\",R8))-0,MID(R8,FIND(\"-\",R8)+1,LEN(R8)-FIND(\"-\",R8)-1)-0))","v":""},{"$f":"IF(OR(ISERROR(FIND(\"-\",S8)),AG8<='export html'!$AR$7),\"\",IF(RIGHT(S8)<>\"*\",MID(S8,FIND(\"-\",S8)+1,LEN(S8)-FIND(\"-\",S8))-0,MID(S8,FIND(\"-\",S8)+1,LEN(S8)-FIND(\"-\",S8)-1)-0))","v":""},null,{"$f":"IF(OR(ISERROR(FIND(\"-\",U8)),AI8<='export html'!$AR$7),\"\",IF(RIGHT(U8)<>\"*\",MID(U8,FIND(\"-\",U8)+1,LEN(U8)-FIND(\"-\",U8))-0,MID(U8,FIND(\"-\",U8)+1,LEN(U8)-FIND(\"-\",U8)-1)-0))","v":""},{"$f":"IF(OR(ISERROR(FIND(\"-\",V8)),AJ8<='export html'!$AR$7),\"\",IF(RIGHT(V8)<>\"*\",MID(V8,FIND(\"-\",V8)+1,LEN(V8)-FIND(\"-\",V8))-0,MID(V8,FIND(\"-\",V8)+1,LEN(V8)-FIND(\"-\",V8)-1)-0))","v":""},{"$f":"IF(OR(ISERROR(FIND(\"-\",W8)),AK8<='export html'!$AR$7),\"\",IF(RIGHT(W8)<>\"*\",MID(W8,FIND(\"-\",W8)+1,LEN(W8)-FIND(\"-\",W8))-0,MID(W8,FIND(\"-\",W8)+1,LEN(W8)-FIND(\"-\",W8)-1)-0))","v":""},{"$f":"IF(OR(ISERROR(FIND(\"-\",X8)),AL8<='export html'!$AR$7),\"\",IF(RIGHT(X8)<>\"*\",MID(X8,FIND(\"-\",X8)+1,LEN(X8)-FIND(\"-\",X8))-0,MID(X8,FIND(\"-\",X8)+1,LEN(X8)-FIND(\"-\",X8)-1)-0))","v":""},{"$f":"IF(OR(ISERROR(FIND(\"-\",Y8)),AM8<='export html'!$AR$7),\"\",IF(RIGHT(Y8)<>\"*\",MID(Y8,FIND(\"-\",Y8)+1,LEN(Y8)-FIND(\"-\",Y8))-0,MID(Y8,FIND(\"-\",Y8)+1,LEN(Y8)-FIND(\"-\",Y8)-1)-0))","v":""},{"$f":"IF(OR(ISERROR(FIND(\"-\",Z8)),AN8<='export html'!$AR$7),\"\",IF(RIGHT(Z8)<>\"*\",MID(Z8,FIND(\"-\",Z8)+1,LEN(Z8)-FIND(\"-\",Z8))-0,MID(Z8,FIND(\"-\",Z8)+1,LEN(Z8)-FIND(\"-\",Z8)-1)-0))","v":""},{"$f":"IF(OR(ISERROR(FIND(\"-\",AA8)),AO8<='export html'!$AR$7),\"\",IF(RIGHT(AA8)<>\"*\",MID(AA8,FIND(\"-\",AA8)+1,LEN(AA8)-FIND(\"-\",AA8))-0,MID(AA8,FIND(\"-\",AA8)+1,LEN(AA8)-FIND(\"-\",AA8)-1)-0))","v":""},{"$f":"IF(OR(ISERROR(FIND(\"-\",AB8)),AP8<='export html'!$AR$7),\"\",IF(RIGHT(AB8)<>\"*\",MID(AB8,FIND(\"-\",AB8)+1,LEN(AB8)-FIND(\"-\",AB8))-0,MID(AB8,FIND(\"-\",AB8)+1,LEN(AB8)-FIND(\"-\",AB8)-1)-0))","v":""},{"$f":"IF(OR(ISERROR(FIND(\"-\",AC8)),AQ8<='export html'!$AR$7),\"\",IF(RIGHT(AC8)<>\"*\",MID(AC8,FIND(\"-\",AC8)+1,LEN(AC8)-FIND(\"-\",AC8))-0,MID(AC8,FIND(\"-\",AC8)+1,LEN(AC8)-FIND(\"-\",AC8)-1)-0))","v":""},{"$f":"IF(OR(ISERROR(FIND(\"-\",AD8)),AR8<='export html'!$AR$7),\"\",IF(RIGHT(AD8)<>\"*\",MID(AD8,FIND(\"-\",AD8)+1,LEN(AD8)-FIND(\"-\",AD8))-0,MID(AD8,FIND(\"-\",AD8)+1,LEN(AD8)-FIND(\"-\",AD8)-1)-0))","v":""},4]
[null,null,null,{"$f":"IF('export html'!T4=\"\",\"\",'export html'!T4)","v":"2024-09-29"},{"$f":"IF('export html'!U4=\"\",\"\",'export html'!U4)","v":5},{"$f":"IF('export html'!V4=\"\",\"\",'export html'!V4)","v":"Lucyvo - Hombeek"},null,null,null,null,null,null,null,{"$f":"IF('export html'!W4=\"\",\"\",'export html'!W4)","v":"5-1"},null,null,2,"Jorn Verhellen",null,null,null,null,null,null,null,56.744164332399627,"Glenn De Vinster",null,null,null,null,null,null,null,null,null,null,null,null,null,null,null,null,null,null,null,null,null,null,null,null,null,null,null,null,null,null,null,null,null,null,null,null,null,null,null,null,null,null,null,null,null,null,5,{"$f":"IF(OR(ISERROR(FIND(\"-\",Q9)),AE9>'export html'!$AR$7),\"\",IF(RIGHT(Q9)<>\"*\",MID(Q9,FIND(\"-\",Q9)+1,LEN(Q9)-FIND(\"-\",Q9))-0,MID(Q9,FIND(\"-\",Q9)+1,LEN(Q9)-FIND(\"-\",Q9)-1)-0))","v":3},{"$f":"IF(OR(ISERROR(FIND(\"-\",R9)),AF9>'export html'!$AR$7),\"\",IF(RIGHT(R9)<>\"*\",MID(R9,FIND(\"-\",R9)+1,LEN(R9)-FIND(\"-\",R9))-0,MID(R9,FIND(\"-\",R9)+1,LEN(R9)-FIND(\"-\",R9)-1)-0))","v":""},{"$f":"IF(OR(ISERROR(FIND(\"-\",S9)),AG9>'export html'!$AR$7),\"\",IF(RIGHT(S9)<>\"*\",MID(S9,FIND(\"-\",S9)+1,LEN(S9)-FIND(\"-\",S9))-0,MID(S9,FIND(\"-\",S9)+1,LEN(S9)-FIND(\"-\",S9)-1)-0))","v":""},{"$f":"IF(OR(ISERROR(FIND(\"-\",T9)),AH9>'export html'!$AR$7),\"\",IF(RIGHT(T9)<>\"*\",MID(T9,FIND(\"-\",T9)+1,LEN(T9)-FIND(\"-\",T9))-0,MID(T9,FIND(\"-\",T9)+1,LEN(T9)-FIND(\"-\",T9)-1)-0))","v":""},null,{"$f":"IF(OR(ISERROR(FIND(\"-\",V9)),AJ9>'export html'!$AR$7),\"\",IF(RIGHT(V9)<>\"*\",MID(V9,FIND(\"-\",V9)+1,LEN(V9)-FIND(\"-\",V9))-0,MID(V9,FIND(\"-\",V9)+1,LEN(V9)-FIND(\"-\",V9)-1)-0))","v":""},{"$f":"IF(OR(ISERROR(FIND(\"-\",W9)),AK9>'export html'!$AR$7),\"\",IF(RIGHT(W9)<>\"*\",MID(W9,FIND(\"-\",W9)+1,LEN(W9)-FIND(\"-\",W9))-0,MID(W9,FIND(\"-\",W9)+1,LEN(W9)-FIND(\"-\",W9)-1)-0))","v":""},{"$f":"IF(OR(ISERROR(FIND(\"-\",X9)),AL9>'export html'!$AR$7),\"\",IF(RIGHT(X9)<>\"*\",MID(X9,FIND(\"-\",X9)+1,LEN(X9)-FIND(\"-\",X9))-0,MID(X9,FIND(\"-\",X9)+1,LEN(X9)-FIND(\"-\",X9)-1)-0))","v":5},{"$f":"IF(OR(ISERROR(FIND(\"-\",Y9)),AM9>'export html'!$AR$7),\"\",IF(RIGHT(Y9)<>\"*\",MID(Y9,FIND(\"-\",Y9)+1,LEN(Y9)-FIND(\"-\",Y9))-0,MID(Y9,FIND(\"-\",Y9)+1,LEN(Y9)-FIND(\"-\",Y9)-1)-0))","v":""},{"$f":"IF(OR(ISERROR(FIND(\"-\",Z9)),AN9>'export html'!$AR$7),\"\",IF(RIGHT(Z9)<>\"*\",MID(Z9,FIND(\"-\",Z9)+1,LEN(Z9)-FIND(\"-\",Z9))-0,MID(Z9,FIND(\"-\",Z9)+1,LEN(Z9)-FIND(\"-\",Z9)-1)-0))","v":""},{"$f":"IF(OR(ISERROR(FIND(\"-\",AA9)),AO9>'export html'!$AR$7),\"\",IF(RIGHT(AA9)<>\"*\",MID(AA9,FIND(\"-\",AA9)+1,LEN(AA9)-FIND(\"-\",AA9))-0,MID(AA9,FIND(\"-\",AA9)+1,LEN(AA9)-FIND(\"-\",AA9)-1)-0))","v":""},{"$f":"IF(OR(ISERROR(FIND(\"-\",AB9)),AP9>'export html'!$AR$7),\"\",IF(RIGHT(AB9)<>\"*\",MID(AB9,FIND(\"-\",AB9)+1,LEN(AB9)-FIND(\"-\",AB9))-0,MID(AB9,FIND(\"-\",AB9)+1,LEN(AB9)-FIND(\"-\",AB9)-1)-0))","v":10},{"$f":"IF(OR(ISERROR(FIND(\"-\",AC9)),AQ9>'export html'!$AR$7),\"\",IF(RIGHT(AC9)<>\"*\",MID(AC9,FIND(\"-\",AC9)+1,LEN(AC9)-FIND(\"-\",AC9))-0,MID(AC9,FIND(\"-\",AC9)+1,LEN(AC9)-FIND(\"-\",AC9)-1)-0))","v":""},{"$f":"IF(OR(ISERROR(FIND(\"-\",AD9)),AR9>'export html'!$AR$7),\"\",IF(RIGHT(AD9)<>\"*\",MID(AD9,FIND(\"-\",AD9)+1,LEN(AD9)-FIND(\"-\",AD9))-0,MID(AD9,FIND(\"-\",AD9)+1,LEN(AD9)-FIND(\"-\",AD9)-1)-0))","v":""},5,{"$f":"IF(OR(ISERROR(FIND(\"-\",Q9)),AE9<='export html'!$AR$7),\"\",IF(RIGHT(Q9)<>\"*\",MID(Q9,FIND(\"-\",Q9)+1,LEN(Q9)-FIND(\"-\",Q9))-0,MID(Q9,FIND(\"-\",Q9)+1,LEN(Q9)-FIND(\"-\",Q9)-1)-0))","v":""},{"$f":"IF(OR(ISERROR(FIND(\"-\",R9)),AF9<='export html'!$AR$7),\"\",IF(RIGHT(R9)<>\"*\",MID(R9,FIND(\"-\",R9)+1,LEN(R9)-FIND(\"-\",R9))-0,MID(R9,FIND(\"-\",R9)+1,LEN(R9)-FIND(\"-\",R9)-1)-0))","v":""},{"$f":"IF(OR(ISERROR(FIND(\"-\",S9)),AG9<='export html'!$AR$7),\"\",IF(RIGHT(S9)<>\"*\",MID(S9,FIND(\"-\",S9)+1,LEN(S9)-FIND(\"-\",S9))-0,MID(S9,FIND(\"-\",S9)+1,LEN(S9)-FIND(\"-\",S9)-1)-0))","v":""},{"$f":"IF(OR(ISERROR(FIND(\"-\",T9)),AH9<='export html'!$AR$7),\"\",IF(RIGHT(T9)<>\"*\",MID(T9,FIND(\"-\",T9)+1,LEN(T9)-FIND(\"-\",T9))-0,MID(T9,FIND(\"-\",T9)+1,LEN(T9)-FIND(\"-\",T9)-1)-0))","v":""},null,{"$f":"IF(OR(ISERROR(FIND(\"-\",V9)),AJ9<='export html'!$AR$7),\"\",IF(RIGHT(V9)<>\"*\",MID(V9,FIND(\"-\",V9)+1,LEN(V9)-FIND(\"-\",V9))-0,MID(V9,FIND(\"-\",V9)+1,LEN(V9)-FIND(\"-\",V9)-1)-0))","v":""},{"$f":"IF(OR(ISERROR(FIND(\"-\",W9)),AK9<='export html'!$AR$7),\"\",IF(RIGHT(W9)<>\"*\",MID(W9,FIND(\"-\",W9)+1,LEN(W9)-FIND(\"-\",W9))-0,MID(W9,FIND(\"-\",W9)+1,LEN(W9)-FIND(\"-\",W9)-1)-0))","v":""},{"$f":"IF(OR(ISERROR(FIND(\"-\",X9)),AL9<='export html'!$AR$7),\"\",IF(RIGHT(X9)<>\"*\",MID(X9,FIND(\"-\",X9)+1,LEN(X9)-FIND(\"-\",X9))-0,MID(X9,FIND(\"-\",X9)+1,LEN(X9)-FIND(\"-\",X9)-1)-0))","v":""},{"$f":"IF(OR(ISERROR(FIND(\"-\",Y9)),AM9<='export html'!$AR$7),\"\",IF(RIGHT(Y9)<>\"*\",MID(Y9,FIND(\"-\",Y9)+1,LEN(Y9)-FIND(\"-\",Y9))-0,MID(Y9,FIND(\"-\",Y9)+1,LEN(Y9)-FIND(\"-\",Y9)-1)-0))","v":""},{"$f":"IF(OR(ISERROR(FIND(\"-\",Z9)),AN9<='export html'!$AR$7),\"\",IF(RIGHT(Z9)<>\"*\",MID(Z9,FIND(\"-\",Z9)+1,LEN(Z9)-FIND(\"-\",Z9))-0,MID(Z9,FIND(\"-\",Z9)+1,LEN(Z9)-FIND(\"-\",Z9)-1)-0))","v":""},{"$f":"IF(OR(ISERROR(FIND(\"-\",AA9)),AO9<='export html'!$AR$7),\"\",IF(RIGHT(AA9)<>\"*\",MID(AA9,FIND(\"-\",AA9)+1,LEN(AA9)-FIND(\"-\",AA9))-0,MID(AA9,FIND(\"-\",AA9)+1,LEN(AA9)-FIND(\"-\",AA9)-1)-0))","v":""},{"$f":"IF(OR(ISERROR(FIND(\"-\",AB9)),AP9<='export html'!$AR$7),\"\",IF(RIGHT(AB9)<>\"*\",MID(AB9,FIND(\"-\",AB9)+1,LEN(AB9)-FIND(\"-\",AB9))-0,MID(AB9,FIND(\"-\",AB9)+1,LEN(AB9)-FIND(\"-\",AB9)-1)-0))","v":""},{"$f":"IF(OR(ISERROR(FIND(\"-\",AC9)),AQ9<='export html'!$AR$7),\"\",IF(RIGHT(AC9)<>\"*\",MID(AC9,FIND(\"-\",AC9)+1,LEN(AC9)-FIND(\"-\",AC9))-0,MID(AC9,FIND(\"-\",AC9)+1,LEN(AC9)-FIND(\"-\",AC9)-1)-0))","v":""},{"$f":"IF(OR(ISERROR(FIND(\"-\",AD9)),AR9<='export html'!$AR$7),\"\",IF(RIGHT(AD9)<>\"*\",MID(AD9,FIND(\"-\",AD9)+1,LEN(AD9)-FIND(\"-\",AD9))-0,MID(AD9,FIND(\"-\",AD9)+1,LEN(AD9)-FIND(\"-\",AD9)-1)-0))","v":""},5]
[null,null,null,{"$f":"IF('export html'!T5=\"\",\"\",'export html'!T5)","v":"2024-09-21"},{"$f":"IF('export html'!U5=\"\",\"\",'export html'!U5)","v":4},{"$f":"IF('export html'!V5=\"\",\"\",'export html'!V5)","v":"SC Duffel - Lucyvo"},null,null,null,null,null,null,null,{"$f":"IF('export html'!W5=\"\",\"\",'export html'!W5)","v":"3-1"},null,null,1,"Wout Beirinckx",null,null,null,null,null,null,null,47.464052287581694,"Maarten De Groof",null,null,null,null,null,null,null,null,null,null,null,null,null,null,null,null,null,null,null,null,null,null,null,null,null,null,null,null,null,null,null,null,null,null,null,null,null,null,null,null,null,null,null,null,null,null,6,{"$f":"IF(OR(ISERROR(FIND(\"-\",Q10)),AE10>'export html'!$AR$7),\"\",IF(RIGHT(Q10)<>\"*\",MID(Q10,FIND(\"-\",Q10)+1,LEN(Q10)-FIND(\"-\",Q10))-0,MID(Q10,FIND(\"-\",Q10)+1,LEN(Q10)-FIND(\"-\",Q10)-1)-0))","v":""},{"$f":"IF(OR(ISERROR(FIND(\"-\",R10)),AF10>'export html'!$AR$7),\"\",IF(RIGHT(R10)<>\"*\",MID(R10,FIND(\"-\",R10)+1,LEN(R10)-FIND(\"-\",R10))-0,MID(R10,FIND(\"-\",R10)+1,LEN(R10)-FIND(\"-\",R10)-1)-0))","v":""},{"$f":"IF(OR(ISERROR(FIND(\"-\",S10)),AG10>'export html'!$AR$7),\"\",IF(RIGHT(S10)<>\"*\",MID(S10,FIND(\"-\",S10)+1,LEN(S10)-FIND(\"-\",S10))-0,MID(S10,FIND(\"-\",S10)+1,LEN(S10)-FIND(\"-\",S10)-1)-0))","v":""},{"$f":"IF(OR(ISERROR(FIND(\"-\",T10)),AH10>'export html'!$AR$7),\"\",IF(RIGHT(T10)<>\"*\",MID(T10,FIND(\"-\",T10)+1,LEN(T10)-FIND(\"-\",T10))-0,MID(T10,FIND(\"-\",T10)+1,LEN(T10)-FIND(\"-\",T10)-1)-0))","v":""},{"$f":"IF(OR(ISERROR(FIND(\"-\",U10)),AI10>'export html'!$AR$7),\"\",IF(RIGHT(U10)<>\"*\",MID(U10,FIND(\"-\",U10)+1,LEN(U10)-FIND(\"-\",U10))-0,MID(U10,FIND(\"-\",U10)+1,LEN(U10)-FIND(\"-\",U10)-1)-0))","v":1},null,{"$f":"IF(OR(ISERROR(FIND(\"-\",W10)),AK10>'export html'!$AR$7),\"\",IF(RIGHT(W10)<>\"*\",MID(W10,FIND(\"-\",W10)+1,LEN(W10)-FIND(\"-\",W10))-0,MID(W10,FIND(\"-\",W10)+1,LEN(W10)-FIND(\"-\",W10)-1)-0))","v":""},{"$f":"IF(OR(ISERROR(FIND(\"-\",X10)),AL10>'export html'!$AR$7),\"\",IF(RIGHT(X10)<>\"*\",MID(X10,FIND(\"-\",X10)+1,LEN(X10)-FIND(\"-\",X10))-0,MID(X10,FIND(\"-\",X10)+1,LEN(X10)-FIND(\"-\",X10)-1)-0))","v":""},{"$f":"IF(OR(ISERROR(FIND(\"-\",Y10)),AM10>'export html'!$AR$7),\"\",IF(RIGHT(Y10)<>\"*\",MID(Y10,FIND(\"-\",Y10)+1,LEN(Y10)-FIND(\"-\",Y10))-0,MID(Y10,FIND(\"-\",Y10)+1,LEN(Y10)-FIND(\"-\",Y10)-1)-0))","v":""},{"$f":"IF(OR(ISERROR(FIND(\"-\",Z10)),AN10>'export html'!$AR$7),\"\",IF(RIGHT(Z10)<>\"*\",MID(Z10,FIND(\"-\",Z10)+1,LEN(Z10)-FIND(\"-\",Z10))-0,MID(Z10,FIND(\"-\",Z10)+1,LEN(Z10)-FIND(\"-\",Z10)-1)-0))","v":0},{"$f":"IF(OR(ISERROR(FIND(\"-\",AA10)),AO10>'export html'!$AR$7),\"\",IF(RIGHT(AA10)<>\"*\",MID(AA10,FIND(\"-\",AA10)+1,LEN(AA10)-FIND(\"-\",AA10))-0,MID(AA10,FIND(\"-\",AA10)+1,LEN(AA10)-FIND(\"-\",AA10)-1)-0))","v":""},{"$f":"IF(OR(ISERROR(FIND(\"-\",AB10)),AP10>'export html'!$AR$7),\"\",IF(RIGHT(AB10)<>\"*\",MID(AB10,FIND(\"-\",AB10)+1,LEN(AB10)-FIND(\"-\",AB10))-0,MID(AB10,FIND(\"-\",AB10)+1,LEN(AB10)-FIND(\"-\",AB10)-1)-0))","v":""},{"$f":"IF(OR(ISERROR(FIND(\"-\",AC10)),AQ10>'export html'!$AR$7),\"\",IF(RIGHT(AC10)<>\"*\",MID(AC10,FIND(\"-\",AC10)+1,LEN(AC10)-FIND(\"-\",AC10))-0,MID(AC10,FIND(\"-\",AC10)+1,LEN(AC10)-FIND(\"-\",AC10)-1)-0))","v":1},{"$f":"IF(OR(ISERROR(FIND(\"-\",AD10)),AR10>'export html'!$AR$7),\"\",IF(RIGHT(AD10)<>\"*\",MID(AD10,FIND(\"-\",AD10)+1,LEN(AD10)-FIND(\"-\",AD10))-0,MID(AD10,FIND(\"-\",AD10)+1,LEN(AD10)-FIND(\"-\",AD10)-1)-0))","v":""},6,{"$f":"IF(OR(ISERROR(FIND(\"-\",Q10)),AE10<='export html'!$AR$7),\"\",IF(RIGHT(Q10)<>\"*\",MID(Q10,FIND(\"-\",Q10)+1,LEN(Q10)-FIND(\"-\",Q10))-0,MID(Q10,FIND(\"-\",Q10)+1,LEN(Q10)-FIND(\"-\",Q10)-1)-0))","v":""},{"$f":"IF(OR(ISERROR(FIND(\"-\",R10)),AF10<='export html'!$AR$7),\"\",IF(RIGHT(R10)<>\"*\",MID(R10,FIND(\"-\",R10)+1,LEN(R10)-FIND(\"-\",R10))-0,MID(R10,FIND(\"-\",R10)+1,LEN(R10)-FIND(\"-\",R10)-1)-0))","v":""},{"$f":"IF(OR(ISERROR(FIND(\"-\",S10)),AG10<='export html'!$AR$7),\"\",IF(RIGHT(S10)<>\"*\",MID(S10,FIND(\"-\",S10)+1,LEN(S10)-FIND(\"-\",S10))-0,MID(S10,FIND(\"-\",S10)+1,LEN(S10)-FIND(\"-\",S10)-1)-0))","v":""},{"$f":"IF(OR(ISERROR(FIND(\"-\",T10)),AH10<='export html'!$AR$7),\"\",IF(RIGHT(T10)<>\"*\",MID(T10,FIND(\"-\",T10)+1,LEN(T10)-FIND(\"-\",T10))-0,MID(T10,FIND(\"-\",T10)+1,LEN(T10)-FIND(\"-\",T10)-1)-0))","v":""},{"$f":"IF(OR(ISERROR(FIND(\"-\",U10)),AI10<='export html'!$AR$7),\"\",IF(RIGHT(U10)<>\"*\",MID(U10,FIND(\"-\",U10)+1,LEN(U10)-FIND(\"-\",U10))-0,MID(U10,FIND(\"-\",U10)+1,LEN(U10)-FIND(\"-\",U10)-1)-0))","v":""},null,{"$f":"IF(OR(ISERROR(FIND(\"-\",W10)),AK10<='export html'!$AR$7),\"\",IF(RIGHT(W10)<>\"*\",MID(W10,FIND(\"-\",W10)+1,LEN(W10)-FIND(\"-\",W10))-0,MID(W10,FIND(\"-\",W10)+1,LEN(W10)-FIND(\"-\",W10)-1)-0))","v":""},{"$f":"IF(OR(ISERROR(FIND(\"-\",X10)),AL10<='export html'!$AR$7),\"\",IF(RIGHT(X10)<>\"*\",MID(X10,FIND(\"-\",X10)+1,LEN(X10)-FIND(\"-\",X10))-0,MID(X10,FIND(\"-\",X10)+1,LEN(X10)-FIND(\"-\",X10)-1)-0))","v":""},{"$f":"IF(OR(ISERROR(FIND(\"-\",Y10)),AM10<='export html'!$AR$7),\"\",IF(RIGHT(Y10)<>\"*\",MID(Y10,FIND(\"-\",Y10)+1,LEN(Y10)-FIND(\"-\",Y10))-0,MID(Y10,FIND(\"-\",Y10)+1,LEN(Y10)-FIND(\"-\",Y10)-1)-0))","v":""},{"$f":"IF(OR(ISERROR(FIND(\"-\",Z10)),AN10<='export html'!$AR$7),\"\",IF(RIGHT(Z10)<>\"*\",MID(Z10,FIND(\"-\",Z10)+1,LEN(Z10)-FIND(\"-\",Z10))-0,MID(Z10,FIND(\"-\",Z10)+1,LEN(Z10)-FIND(\"-\",Z10)-1)-0))","v":""},{"$f":"IF(OR(ISERROR(FIND(\"-\",AA10)),AO10<='export html'!$AR$7),\"\",IF(RIGHT(AA10)<>\"*\",MID(AA10,FIND(\"-\",AA10)+1,LEN(AA10)-FIND(\"-\",AA10))-0,MID(AA10,FIND(\"-\",AA10)+1,LEN(AA10)-FIND(\"-\",AA10)-1)-0))","v":""},{"$f":"IF(OR(ISERROR(FIND(\"-\",AB10)),AP10<='export html'!$AR$7),\"\",IF(RIGHT(AB10)<>\"*\",MID(AB10,FIND(\"-\",AB10)+1,LEN(AB10)-FIND(\"-\",AB10))-0,MID(AB10,FIND(\"-\",AB10)+1,LEN(AB10)-FIND(\"-\",AB10)-1)-0))","v":""},{"$f":"IF(OR(ISERROR(FIND(\"-\",AC10)),AQ10<='export html'!$AR$7),\"\",IF(RIGHT(AC10)<>\"*\",MID(AC10,FIND(\"-\",AC10)+1,LEN(AC10)-FIND(\"-\",AC10))-0,MID(AC10,FIND(\"-\",AC10)+1,LEN(AC10)-FIND(\"-\",AC10)-1)-0))","v":""},{"$f":"IF(OR(ISERROR(FIND(\"-\",AD10)),AR10<='export html'!$AR$7),\"\",IF(RIGHT(AD10)<>\"*\",MID(AD10,FIND(\"-\",AD10)+1,LEN(AD10)-FIND(\"-\",AD10))-0,MID(AD10,FIND(\"-\",AD10)+1,LEN(AD10)-FIND(\"-\",AD10)-1)-0))","v":""},6]
[null,null,null,{"$f":"IF('export html'!T6=\"\",\"\",'export html'!T6)","v":"2024-09-15"},{"$f":"IF('export html'!U6=\"\",\"\",'export html'!U6)","v":3},{"$f":"IF('export html'!V6=\"\",\"\",'export html'!V6)","v":"Lucyvo - Alberta Schilde"},null,null,null,null,null,null,null,{"$f":"IF('export html'!W6=\"\",\"\",'export html'!W6)","v":"1-5"},null,null,1,"Maarten De Groof",null,null,null,null,null,null,null,40.803921568627452,"Stijn Hofmans",null,null,null,null,null,null,null,null,null,null,null,null,null,null,null,null,null,null,null,null,null,null,null,null,null,null,null,null,null,null,null,null,null,null,null,null,null,null,null,null,null,null,null,null,null,null,7,{"$f":"IF(OR(ISERROR(FIND(\"-\",Q11)),AE11>'export html'!$AR$7),\"\",IF(RIGHT(Q11)<>\"*\",MID(Q11,FIND(\"-\",Q11)+1,LEN(Q11)-FIND(\"-\",Q11))-0,MID(Q11,FIND(\"-\",Q11)+1,LEN(Q11)-FIND(\"-\",Q11)-1)-0))","v":""},{"$f":"IF(OR(ISERROR(FIND(\"-\",R11)),AF11>'export html'!$AR$7),\"\",IF(RIGHT(R11)<>\"*\",MID(R11,FIND(\"-\",R11)+1,LEN(R11)-FIND(\"-\",R11))-0,MID(R11,FIND(\"-\",R11)+1,LEN(R11)-FIND(\"-\",R11)-1)-0))","v":""},{"$f":"IF(OR(ISERROR(FIND(\"-\",S11)),AG11>'export html'!$AR$7),\"\",IF(RIGHT(S11)<>\"*\",MID(S11,FIND(\"-\",S11)+1,LEN(S11)-FIND(\"-\",S11))-0,MID(S11,FIND(\"-\",S11)+1,LEN(S11)-FIND(\"-\",S11)-1)-0))","v":""},{"$f":"IF(OR(ISERROR(FIND(\"-\",T11)),AH11>'export html'!$AR$7),\"\",IF(RIGHT(T11)<>\"*\",MID(T11,FIND(\"-\",T11)+1,LEN(T11)-FIND(\"-\",T11))-0,MID(T11,FIND(\"-\",T11)+1,LEN(T11)-FIND(\"-\",T11)-1)-0))","v":1},{"$f":"IF(OR(ISERROR(FIND(\"-\",U11)),AI11>'export html'!$AR$7),\"\",IF(RIGHT(U11)<>\"*\",MID(U11,FIND(\"-\",U11)+1,LEN(U11)-FIND(\"-\",U11))-0,MID(U11,FIND(\"-\",U11)+1,LEN(U11)-FIND(\"-\",U11)-1)-0))","v":""},{"$f":"IF(OR(ISERROR(FIND(\"-\",V11)),AJ11>'export html'!$AR$7),\"\",IF(RIGHT(V11)<>\"*\",MID(V11,FIND(\"-\",V11)+1,LEN(V11)-FIND(\"-\",V11))-0,MID(V11,FIND(\"-\",V11)+1,LEN(V11)-FIND(\"-\",V11)-1)-0))","v":""},null,{"$f":"IF(OR(ISERROR(FIND(\"-\",X11)),AL11>'export html'!$AR$7),\"\",IF(RIGHT(X11)<>\"*\",MID(X11,FIND(\"-\",X11)+1,LEN(X11)-FIND(\"-\",X11))-0,MID(X11,FIND(\"-\",X11)+1,LEN(X11)-FIND(\"-\",X11)-1)-0))","v":""},{"$f":"IF(OR(ISERROR(FIND(\"-\",Y11)),AM11>'export html'!$AR$7),\"\",IF(RIGHT(Y11)<>\"*\",MID(Y11,FIND(\"-\",Y11)+1,LEN(Y11)-FIND(\"-\",Y11))-0,MID(Y11,FIND(\"-\",Y11)+1,LEN(Y11)-FIND(\"-\",Y11)-1)-0))","v":""},{"$f":"IF(OR(ISERROR(FIND(\"-\",Z11)),AN11>'export html'!$AR$7),\"\",IF(RIGHT(Z11)<>\"*\",MID(Z11,FIND(\"-\",Z11)+1,LEN(Z11)-FIND(\"-\",Z11))-0,MID(Z11,FIND(\"-\",Z11)+1,LEN(Z11)-FIND(\"-\",Z11)-1)-0))","v":0},{"$f":"IF(OR(ISERROR(FIND(\"-\",AA11)),AO11>'export html'!$AR$7),\"\",IF(RIGHT(AA11)<>\"*\",MID(AA11,FIND(\"-\",AA11)+1,LEN(AA11)-FIND(\"-\",AA11))-0,MID(AA11,FIND(\"-\",AA11)+1,LEN(AA11)-FIND(\"-\",AA11)-1)-0))","v":5},{"$f":"IF(OR(ISERROR(FIND(\"-\",AB11)),AP11>'export html'!$AR$7),\"\",IF(RIGHT(AB11)<>\"*\",MID(AB11,FIND(\"-\",AB11)+1,LEN(AB11)-FIND(\"-\",AB11))-0,MID(AB11,FIND(\"-\",AB11)+1,LEN(AB11)-FIND(\"-\",AB11)-1)-0))","v":""},{"$f":"IF(OR(ISERROR(FIND(\"-\",AC11)),AQ11>'export html'!$AR$7),\"\",IF(RIGHT(AC11)<>\"*\",MID(AC11,FIND(\"-\",AC11)+1,LEN(AC11)-FIND(\"-\",AC11))-0,MID(AC11,FIND(\"-\",AC11)+1,LEN(AC11)-FIND(\"-\",AC11)-1)-0))","v":""},{"$f":"IF(OR(ISERROR(FIND(\"-\",AD11)),AR11>'export html'!$AR$7),\"\",IF(RIGHT(AD11)<>\"*\",MID(AD11,FIND(\"-\",AD11)+1,LEN(AD11)-FIND(\"-\",AD11))-0,MID(AD11,FIND(\"-\",AD11)+1,LEN(AD11)-FIND(\"-\",AD11)-1)-0))","v":""},7,{"$f":"IF(OR(ISERROR(FIND(\"-\",Q11)),AE11<='export html'!$AR$7),\"\",IF(RIGHT(Q11)<>\"*\",MID(Q11,FIND(\"-\",Q11)+1,LEN(Q11)-FIND(\"-\",Q11))-0,MID(Q11,FIND(\"-\",Q11)+1,LEN(Q11)-FIND(\"-\",Q11)-1)-0))","v":""},{"$f":"IF(OR(ISERROR(FIND(\"-\",R11)),AF11<='export html'!$AR$7),\"\",IF(RIGHT(R11)<>\"*\",MID(R11,FIND(\"-\",R11)+1,LEN(R11)-FIND(\"-\",R11))-0,MID(R11,FIND(\"-\",R11)+1,LEN(R11)-FIND(\"-\",R11)-1)-0))","v":""},{"$f":"IF(OR(ISERROR(FIND(\"-\",S11)),AG11<='export html'!$AR$7),\"\",IF(RIGHT(S11)<>\"*\",MID(S11,FIND(\"-\",S11)+1,LEN(S11)-FIND(\"-\",S11))-0,MID(S11,FIND(\"-\",S11)+1,LEN(S11)-FIND(\"-\",S11)-1)-0))","v":""},{"$f":"IF(OR(ISERROR(FIND(\"-\",T11)),AH11<='export html'!$AR$7),\"\",IF(RIGHT(T11)<>\"*\",MID(T11,FIND(\"-\",T11)+1,LEN(T11)-FIND(\"-\",T11))-0,MID(T11,FIND(\"-\",T11)+1,LEN(T11)-FIND(\"-\",T11)-1)-0))","v":""},{"$f":"IF(OR(ISERROR(FIND(\"-\",U11)),AI11<='export html'!$AR$7),\"\",IF(RIGHT(U11)<>\"*\",MID(U11,FIND(\"-\",U11)+1,LEN(U11)-FIND(\"-\",U11))-0,MID(U11,FIND(\"-\",U11)+1,LEN(U11)-FIND(\"-\",U11)-1)-0))","v":""},{"$f":"IF(OR(ISERROR(FIND(\"-\",V11)),AJ11<='export html'!$AR$7),\"\",IF(RIGHT(V11)<>\"*\",MID(V11,FIND(\"-\",V11)+1,LEN(V11)-FIND(\"-\",V11))-0,MID(V11,FIND(\"-\",V11)+1,LEN(V11)-FIND(\"-\",V11)-1)-0))","v":""},null,{"$f":"IF(OR(ISERROR(FIND(\"-\",X11)),AL11<='export html'!$AR$7),\"\",IF(RIGHT(X11)<>\"*\",MID(X11,FIND(\"-\",X11)+1,LEN(X11)-FIND(\"-\",X11))-0,MID(X11,FIND(\"-\",X11)+1,LEN(X11)-FIND(\"-\",X11)-1)-0))","v":""},{"$f":"IF(OR(ISERROR(FIND(\"-\",Y11)),AM11<='export html'!$AR$7),\"\",IF(RIGHT(Y11)<>\"*\",MID(Y11,FIND(\"-\",Y11)+1,LEN(Y11)-FIND(\"-\",Y11))-0,MID(Y11,FIND(\"-\",Y11)+1,LEN(Y11)-FIND(\"-\",Y11)-1)-0))","v":""},{"$f":"IF(OR(ISERROR(FIND(\"-\",Z11)),AN11<='export html'!$AR$7),\"\",IF(RIGHT(Z11)<>\"*\",MID(Z11,FIND(\"-\",Z11)+1,LEN(Z11)-FIND(\"-\",Z11))-0,MID(Z11,FIND(\"-\",Z11)+1,LEN(Z11)-FIND(\"-\",Z11)-1)-0))","v":""},{"$f":"IF(OR(ISERROR(FIND(\"-\",AA11)),AO11<='export html'!$AR$7),\"\",IF(RIGHT(AA11)<>\"*\",MID(AA11,FIND(\"-\",AA11)+1,LEN(AA11)-FIND(\"-\",AA11))-0,MID(AA11,FIND(\"-\",AA11)+1,LEN(AA11)-FIND(\"-\",AA11)-1)-0))","v":""},{"$f":"IF(OR(ISERROR(FIND(\"-\",AB11)),AP11<='export html'!$AR$7),\"\",IF(RIGHT(AB11)<>\"*\",MID(AB11,FIND(\"-\",AB11)+1,LEN(AB11)-FIND(\"-\",AB11))-0,MID(AB11,FIND(\"-\",AB11)+1,LEN(AB11)-FIND(\"-\",AB11)-1)-0))","v":""},{"$f":"IF(OR(ISERROR(FIND(\"-\",AC11)),AQ11<='export html'!$AR$7),\"\",IF(RIGHT(AC11)<>\"*\",MID(AC11,FIND(\"-\",AC11)+1,LEN(AC11)-FIND(\"-\",AC11))-0,MID(AC11,FIND(\"-\",AC11)+1,LEN(AC11)-FIND(\"-\",AC11)-1)-0))","v":""},{"$f":"IF(OR(ISERROR(FIND(\"-\",AD11)),AR11<='export html'!$AR$7),\"\",IF(RIGHT(AD11)<>\"*\",MID(AD11,FIND(\"-\",AD11)+1,LEN(AD11)-FIND(\"-\",AD11))-0,MID(AD11,FIND(\"-\",AD11)+1,LEN(AD11)-FIND(\"-\",AD11)-1)-0))","v":""},7]
[null,null,null,{"$f":"IF('export html'!T7=\"\",\"\",'export html'!T7)","v":"2024-09-08"},{"$f":"IF('export html'!U7=\"\",\"\",'export html'!U7)","v":2},{"$f":"IF('export html'!V7=\"\",\"\",'export html'!V7)","v":"Goka - Lucyvo"},null,null,null,null,null,null,null,{"$f":"IF('export html'!W7=\"\",\"\",'export html'!W7)","v":"3-0"},null,null,1,"Glenn De Vinster",null,null,null,null,null,null,null,38.222222222222221,"Wannes Nyckees",null,null,null,null,null,null,null,null,null,null,null,null,null,null,null,null,null,null,null,null,null,null,null,null,null,null,null,null,null,null,null,null,null,null,null,null,null,null,null,null,null,null,null,null,null,null,8,{"$f":"IF(OR(ISERROR(FIND(\"-\",Q12)),AE12>'export html'!$AR$7),\"\",IF(RIGHT(Q12)<>\"*\",MID(Q12,FIND(\"-\",Q12)+1,LEN(Q12)-FIND(\"-\",Q12))-0,MID(Q12,FIND(\"-\",Q12)+1,LEN(Q12)-FIND(\"-\",Q12)-1)-0))","v":""},{"$f":"IF(OR(ISERROR(FIND(\"-\",R12)),AF12>'export html'!$AR$7),\"\",IF(RIGHT(R12)<>\"*\",MID(R12,FIND(\"-\",R12)+1,LEN(R12)-FIND(\"-\",R12))-0,MID(R12,FIND(\"-\",R12)+1,LEN(R12)-FIND(\"-\",R12)-1)-0))","v":""},{"$f":"IF(OR(ISERROR(FIND(\"-\",S12)),AG12>'export html'!$AR$7),\"\",IF(RIGHT(S12)<>\"*\",MID(S12,FIND(\"-\",S12)+1,LEN(S12)-FIND(\"-\",S12))-0,MID(S12,FIND(\"-\",S12)+1,LEN(S12)-FIND(\"-\",S12)-1)-0))","v":""},{"$f":"IF(OR(ISERROR(FIND(\"-\",T12)),AH12>'export html'!$AR$7),\"\",IF(RIGHT(T12)<>\"*\",MID(T12,FIND(\"-\",T12)+1,LEN(T12)-FIND(\"-\",T12))-0,MID(T12,FIND(\"-\",T12)+1,LEN(T12)-FIND(\"-\",T12)-1)-0))","v":""},{"$f":"IF(OR(ISERROR(FIND(\"-\",U12)),AI12>'export html'!$AR$7),\"\",IF(RIGHT(U12)<>\"*\",MID(U12,FIND(\"-\",U12)+1,LEN(U12)-FIND(\"-\",U12))-0,MID(U12,FIND(\"-\",U12)+1,LEN(U12)-FIND(\"-\",U12)-1)-0))","v":""},{"$f":"IF(OR(ISERROR(FIND(\"-\",V12)),AJ12>'export html'!$AR$7),\"\",IF(RIGHT(V12)<>\"*\",MID(V12,FIND(\"-\",V12)+1,LEN(V12)-FIND(\"-\",V12))-0,MID(V12,FIND(\"-\",V12)+1,LEN(V12)-FIND(\"-\",V12)-1)-0))","v":3},{"$f":"IF(OR(ISERROR(FIND(\"-\",W12)),AK12>'export html'!$AR$7),\"\",IF(RIGHT(W12)<>\"*\",MID(W12,FIND(\"-\",W12)+1,LEN(W12)-FIND(\"-\",W12))-0,MID(W12,FIND(\"-\",W12)+1,LEN(W12)-FIND(\"-\",W12)-1)-0))","v":""},null,{"$f":"IF(OR(ISERROR(FIND(\"-\",Y12)),AM12>'export html'!$AR$7),\"\",IF(RIGHT(Y12)<>\"*\",MID(Y12,FIND(\"-\",Y12)+1,LEN(Y12)-FIND(\"-\",Y12))-0,MID(Y12,FIND(\"-\",Y12)+1,LEN(Y12)-FIND(\"-\",Y12)-1)-0))","v":""},{"$f":"IF(OR(ISERROR(FIND(\"-\",Z12)),AN12>'export html'!$AR$7),\"\",IF(RIGHT(Z12)<>\"*\",MID(Z12,FIND(\"-\",Z12)+1,LEN(Z12)-FIND(\"-\",Z12))-0,MID(Z12,FIND(\"-\",Z12)+1,LEN(Z12)-FIND(\"-\",Z12)-1)-0))","v":""},{"$f":"IF(OR(ISERROR(FIND(\"-\",AA12)),AO12>'export html'!$AR$7),\"\",IF(RIGHT(AA12)<>\"*\",MID(AA12,FIND(\"-\",AA12)+1,LEN(AA12)-FIND(\"-\",AA12))-0,MID(AA12,FIND(\"-\",AA12)+1,LEN(AA12)-FIND(\"-\",AA12)-1)-0))","v":""},{"$f":"IF(OR(ISERROR(FIND(\"-\",AB12)),AP12>'export html'!$AR$7),\"\",IF(RIGHT(AB12)<>\"*\",MID(AB12,FIND(\"-\",AB12)+1,LEN(AB12)-FIND(\"-\",AB12))-0,MID(AB12,FIND(\"-\",AB12)+1,LEN(AB12)-FIND(\"-\",AB12)-1)-0))","v":6},{"$f":"IF(OR(ISERROR(FIND(\"-\",AC12)),AQ12>'export html'!$AR$7),\"\",IF(RIGHT(AC12)<>\"*\",MID(AC12,FIND(\"-\",AC12)+1,LEN(AC12)-FIND(\"-\",AC12))-0,MID(AC12,FIND(\"-\",AC12)+1,LEN(AC12)-FIND(\"-\",AC12)-1)-0))","v":""},{"$f":"IF(OR(ISERROR(FIND(\"-\",AD12)),AR12>'export html'!$AR$7),\"\",IF(RIGHT(AD12)<>\"*\",MID(AD12,FIND(\"-\",AD12)+1,LEN(AD12)-FIND(\"-\",AD12))-0,MID(AD12,FIND(\"-\",AD12)+1,LEN(AD12)-FIND(\"-\",AD12)-1)-0))","v":1},8,{"$f":"IF(OR(ISERROR(FIND(\"-\",Q12)),AE12<='export html'!$AR$7),\"\",IF(RIGHT(Q12)<>\"*\",MID(Q12,FIND(\"-\",Q12)+1,LEN(Q12)-FIND(\"-\",Q12))-0,MID(Q12,FIND(\"-\",Q12)+1,LEN(Q12)-FIND(\"-\",Q12)-1)-0))","v":""},{"$f":"IF(OR(ISERROR(FIND(\"-\",R12)),AF12<='export html'!$AR$7),\"\",IF(RIGHT(R12)<>\"*\",MID(R12,FIND(\"-\",R12)+1,LEN(R12)-FIND(\"-\",R12))-0,MID(R12,FIND(\"-\",R12)+1,LEN(R12)-FIND(\"-\",R12)-1)-0))","v":""},{"$f":"IF(OR(ISERROR(FIND(\"-\",S12)),AG12<='export html'!$AR$7),\"\",IF(RIGHT(S12)<>\"*\",MID(S12,FIND(\"-\",S12)+1,LEN(S12)-FIND(\"-\",S12))-0,MID(S12,FIND(\"-\",S12)+1,LEN(S12)-FIND(\"-\",S12)-1)-0))","v":""},{"$f":"IF(OR(ISERROR(FIND(\"-\",T12)),AH12<='export html'!$AR$7),\"\",IF(RIGHT(T12)<>\"*\",MID(T12,FIND(\"-\",T12)+1,LEN(T12)-FIND(\"-\",T12))-0,MID(T12,FIND(\"-\",T12)+1,LEN(T12)-FIND(\"-\",T12)-1)-0))","v":""},{"$f":"IF(OR(ISERROR(FIND(\"-\",U12)),AI12<='export html'!$AR$7),\"\",IF(RIGHT(U12)<>\"*\",MID(U12,FIND(\"-\",U12)+1,LEN(U12)-FIND(\"-\",U12))-0,MID(U12,FIND(\"-\",U12)+1,LEN(U12)-FIND(\"-\",U12)-1)-0))","v":""},{"$f":"IF(OR(ISERROR(FIND(\"-\",V12)),AJ12<='export html'!$AR$7),\"\",IF(RIGHT(V12)<>\"*\",MID(V12,FIND(\"-\",V12)+1,LEN(V12)-FIND(\"-\",V12))-0,MID(V12,FIND(\"-\",V12)+1,LEN(V12)-FIND(\"-\",V12)-1)-0))","v":""},{"$f":"IF(OR(ISERROR(FIND(\"-\",W12)),AK12<='export html'!$AR$7),\"\",IF(RIGHT(W12)<>\"*\",MID(W12,FIND(\"-\",W12)+1,LEN(W12)-FIND(\"-\",W12))-0,MID(W12,FIND(\"-\",W12)+1,LEN(W12)-FIND(\"-\",W12)-1)-0))","v":""},null,{"$f":"IF(OR(ISERROR(FIND(\"-\",Y12)),AM12<='export html'!$AR$7),\"\",IF(RIGHT(Y12)<>\"*\",MID(Y12,FIND(\"-\",Y12)+1,LEN(Y12)-FIND(\"-\",Y12))-0,MID(Y12,FIND(\"-\",Y12)+1,LEN(Y12)-FIND(\"-\",Y12)-1)-0))","v":""},{"$f":"IF(OR(ISERROR(FIND(\"-\",Z12)),AN12<='export html'!$AR$7),\"\",IF(RIGHT(Z12)<>\"*\",MID(Z12,FIND(\"-\",Z12)+1,LEN(Z12)-FIND(\"-\",Z12))-0,MID(Z12,FIND(\"-\",Z12)+1,LEN(Z12)-FIND(\"-\",Z12)-1)-0))","v":""},{"$f":"IF(OR(ISERROR(FIND(\"-\",AA12)),AO12<='export html'!$AR$7),\"\",IF(RIGHT(AA12)<>\"*\",MID(AA12,FIND(\"-\",AA12)+1,LEN(AA12)-FIND(\"-\",AA12))-0,MID(AA12,FIND(\"-\",AA12)+1,LEN(AA12)-FIND(\"-\",AA12)-1)-0))","v":""},{"$f":"IF(OR(ISERROR(FIND(\"-\",AB12)),AP12<='export html'!$AR$7),\"\",IF(RIGHT(AB12)<>\"*\",MID(AB12,FIND(\"-\",AB12)+1,LEN(AB12)-FIND(\"-\",AB12))-0,MID(AB12,FIND(\"-\",AB12)+1,LEN(AB12)-FIND(\"-\",AB12)-1)-0))","v":""},{"$f":"IF(OR(ISERROR(FIND(\"-\",AC12)),AQ12<='export html'!$AR$7),\"\",IF(RIGHT(AC12)<>\"*\",MID(AC12,FIND(\"-\",AC12)+1,LEN(AC12)-FIND(\"-\",AC12))-0,MID(AC12,FIND(\"-\",AC12)+1,LEN(AC12)-FIND(\"-\",AC12)-1)-0))","v":""},{"$f":"IF(OR(ISERROR(FIND(\"-\",AD12)),AR12<='export html'!$AR$7),\"\",IF(RIGHT(AD12)<>\"*\",MID(AD12,FIND(\"-\",AD12)+1,LEN(AD12)-FIND(\"-\",AD12))-0,MID(AD12,FIND(\"-\",AD12)+1,LEN(AD12)-FIND(\"-\",AD12)-1)-0))","v":""},8]
[null,null,null,{"$f":"IF('export html'!T8=\"\",\"\",'export html'!T8)","v":""},{"$f":"IF('export html'!U8=\"\",\"\",'export html'!U8)","v":""},{"$f":"IF('export html'!V8=\"\",\"\",'export html'!V8)","v":""},null,null,null,null,null,null,null,{"$f":"IF('export html'!W8=\"\",\"\",'export html'!W8)","v":""},null,null,null,null,null,null,null,null,null,null,null,null,null,null,null,null,null,null,null,null,null,null,null,null,null,null,null,null,null,null,null,null,null,null,null,null,null,null,null,null,null,null,null,null,null,null,null,null,null,null,null,null,null,null,null,null,null,null,null,9,{"$f":"IF(OR(ISERROR(FIND(\"-\",Q13)),AE13>'export html'!$AR$7),\"\",IF(RIGHT(Q13)<>\"*\",MID(Q13,FIND(\"-\",Q13)+1,LEN(Q13)-FIND(\"-\",Q13))-0,MID(Q13,FIND(\"-\",Q13)+1,LEN(Q13)-FIND(\"-\",Q13)-1)-0))","v":""},{"$f":"IF(OR(ISERROR(FIND(\"-\",R13)),AF13>'export html'!$AR$7),\"\",IF(RIGHT(R13)<>\"*\",MID(R13,FIND(\"-\",R13)+1,LEN(R13)-FIND(\"-\",R13))-0,MID(R13,FIND(\"-\",R13)+1,LEN(R13)-FIND(\"-\",R13)-1)-0))","v":""},{"$f":"IF(OR(ISERROR(FIND(\"-\",S13)),AG13>'export html'!$AR$7),\"\",IF(RIGHT(S13)<>\"*\",MID(S13,FIND(\"-\",S13)+1,LEN(S13)-FIND(\"-\",S13))-0,MID(S13,FIND(\"-\",S13)+1,LEN(S13)-FIND(\"-\",S13)-1)-0))","v":""},{"$f":"IF(OR(ISERROR(FIND(\"-\",T13)),AH13>'export html'!$AR$7),\"\",IF(RIGHT(T13)<>\"*\",MID(T13,FIND(\"-\",T13)+1,LEN(T13)-FIND(\"-\",T13))-0,MID(T13,FIND(\"-\",T13)+1,LEN(T13)-FIND(\"-\",T13)-1)-0))","v":""},{"$f":"IF(OR(ISERROR(FIND(\"-\",U13)),AI13>'export html'!$AR$7),\"\",IF(RIGHT(U13)<>\"*\",MID(U13,FIND(\"-\",U13)+1,LEN(U13)-FIND(\"-\",U13))-0,MID(U13,FIND(\"-\",U13)+1,LEN(U13)-FIND(\"-\",U13)-1)-0))","v":8},{"$f":"IF(OR(ISERROR(FIND(\"-\",V13)),AJ13>'export html'!$AR$7),\"\",IF(RIGHT(V13)<>\"*\",MID(V13,FIND(\"-\",V13)+1,LEN(V13)-FIND(\"-\",V13))-0,MID(V13,FIND(\"-\",V13)+1,LEN(V13)-FIND(\"-\",V13)-1)-0))","v":7},{"$f":"IF(OR(ISERROR(FIND(\"-\",W13)),AK13>'export html'!$AR$7),\"\",IF(RIGHT(W13)<>\"*\",MID(W13,FIND(\"-\",W13)+1,LEN(W13)-FIND(\"-\",W13))-0,MID(W13,FIND(\"-\",W13)+1,LEN(W13)-FIND(\"-\",W13)-1)-0))","v":""},{"$f":"IF(OR(ISERROR(FIND(\"-\",X13)),AL13>'export html'!$AR$7),\"\",IF(RIGHT(X13)<>\"*\",MID(X13,FIND(\"-\",X13)+1,LEN(X13)-FIND(\"-\",X13))-0,MID(X13,FIND(\"-\",X13)+1,LEN(X13)-FIND(\"-\",X13)-1)-0))","v":6},null,{"$f":"IF(OR(ISERROR(FIND(\"-\",Z13)),AN13>'export html'!$AR$7),\"\",IF(RIGHT(Z13)<>\"*\",MID(Z13,FIND(\"-\",Z13)+1,LEN(Z13)-FIND(\"-\",Z13))-0,MID(Z13,FIND(\"-\",Z13)+1,LEN(Z13)-FIND(\"-\",Z13)-1)-0))","v":""},{"$f":"IF(OR(ISERROR(FIND(\"-\",AA13)),AO13>'export html'!$AR$7),\"\",IF(RIGHT(AA13)<>\"*\",MID(AA13,FIND(\"-\",AA13)+1,LEN(AA13)-FIND(\"-\",AA13))-0,MID(AA13,FIND(\"-\",AA13)+1,LEN(AA13)-FIND(\"-\",AA13)-1)-0))","v":""},{"$f":"IF(OR(ISERROR(FIND(\"-\",AB13)),AP13>'export html'!$AR$7),\"\",IF(RIGHT(AB13)<>\"*\",MID(AB13,FIND(\"-\",AB13)+1,LEN(AB13)-FIND(\"-\",AB13))-0,MID(AB13,FIND(\"-\",AB13)+1,LEN(AB13)-FIND(\"-\",AB13)-1)-0))","v":""},{"$f":"IF(OR(ISERROR(FIND(\"-\",AC13)),AQ13>'export html'!$AR$7),\"\",IF(RIGHT(AC13)<>\"*\",MID(AC13,FIND(\"-\",AC13)+1,LEN(AC13)-FIND(\"-\",AC13))-0,MID(AC13,FIND(\"-\",AC13)+1,LEN(AC13)-FIND(\"-\",AC13)-1)-0))","v":""},{"$f":"IF(OR(ISERROR(FIND(\"-\",AD13)),AR13>'export html'!$AR$7),\"\",IF(RIGHT(AD13)<>\"*\",MID(AD13,FIND(\"-\",AD13)+1,LEN(AD13)-FIND(\"-\",AD13))-0,MID(AD13,FIND(\"-\",AD13)+1,LEN(AD13)-FIND(\"-\",AD13)-1)-0))","v":""},9,{"$f":"IF(OR(ISERROR(FIND(\"-\",Q13)),AE13<='export html'!$AR$7),\"\",IF(RIGHT(Q13)<>\"*\",MID(Q13,FIND(\"-\",Q13)+1,LEN(Q13)-FIND(\"-\",Q13))-0,MID(Q13,FIND(\"-\",Q13)+1,LEN(Q13)-FIND(\"-\",Q13)-1)-0))","v":""},{"$f":"IF(OR(ISERROR(FIND(\"-\",R13)),AF13<='export html'!$AR$7),\"\",IF(RIGHT(R13)<>\"*\",MID(R13,FIND(\"-\",R13)+1,LEN(R13)-FIND(\"-\",R13))-0,MID(R13,FIND(\"-\",R13)+1,LEN(R13)-FIND(\"-\",R13)-1)-0))","v":""},{"$f":"IF(OR(ISERROR(FIND(\"-\",S13)),AG13<='export html'!$AR$7),\"\",IF(RIGHT(S13)<>\"*\",MID(S13,FIND(\"-\",S13)+1,LEN(S13)-FIND(\"-\",S13))-0,MID(S13,FIND(\"-\",S13)+1,LEN(S13)-FIND(\"-\",S13)-1)-0))","v":""},{"$f":"IF(OR(ISERROR(FIND(\"-\",T13)),AH13<='export html'!$AR$7),\"\",IF(RIGHT(T13)<>\"*\",MID(T13,FIND(\"-\",T13)+1,LEN(T13)-FIND(\"-\",T13))-0,MID(T13,FIND(\"-\",T13)+1,LEN(T13)-FIND(\"-\",T13)-1)-0))","v":""},{"$f":"IF(OR(ISERROR(FIND(\"-\",U13)),AI13<='export html'!$AR$7),\"\",IF(RIGHT(U13)<>\"*\",MID(U13,FIND(\"-\",U13)+1,LEN(U13)-FIND(\"-\",U13))-0,MID(U13,FIND(\"-\",U13)+1,LEN(U13)-FIND(\"-\",U13)-1)-0))","v":""},{"$f":"IF(OR(ISERROR(FIND(\"-\",V13)),AJ13<='export html'!$AR$7),\"\",IF(RIGHT(V13)<>\"*\",MID(V13,FIND(\"-\",V13)+1,LEN(V13)-FIND(\"-\",V13))-0,MID(V13,FIND(\"-\",V13)+1,LEN(V13)-FIND(\"-\",V13)-1)-0))","v":""},{"$f":"IF(OR(ISERROR(FIND(\"-\",W13)),AK13<='export html'!$AR$7),\"\",IF(RIGHT(W13)<>\"*\",MID(W13,FIND(\"-\",W13)+1,LEN(W13)-FIND(\"-\",W13))-0,MID(W13,FIND(\"-\",W13)+1,LEN(W13)-FIND(\"-\",W13)-1)-0))","v":""},{"$f":"IF(OR(ISERROR(FIND(\"-\",X13)),AL13<='export html'!$AR$7),\"\",IF(RIGHT(X13)<>\"*\",MID(X13,FIND(\"-\",X13)+1,LEN(X13)-FIND(\"-\",X13))-0,MID(X13,FIND(\"-\",X13)+1,LEN(X13)-FIND(\"-\",X13)-1)-0))","v":""},null,{"$f":"IF(OR(ISERROR(FIND(\"-\",Z13)),AN13<='export html'!$AR$7),\"\",IF(RIGHT(Z13)<>\"*\",MID(Z13,FIND(\"-\",Z13)+1,LEN(Z13)-FIND(\"-\",Z13))-0,MID(Z13,FIND(\"-\",Z13)+1,LEN(Z13)-FIND(\"-\",Z13)-1)-0))","v":""},{"$f":"IF(OR(ISERROR(FIND(\"-\",AA13)),AO13<='export html'!$AR$7),\"\",IF(RIGHT(AA13)<>\"*\",MID(AA13,FIND(\"-\",AA13)+1,LEN(AA13)-FIND(\"-\",AA13))-0,MID(AA13,FIND(\"-\",AA13)+1,LEN(AA13)-FIND(\"-\",AA13)-1)-0))","v":""},{"$f":"IF(OR(ISERROR(FIND(\"-\",AB13)),AP13<='export html'!$AR$7),\"\",IF(RIGHT(AB13)<>\"*\",MID(AB13,FIND(\"-\",AB13)+1,LEN(AB13)-FIND(\"-\",AB13))-0,MID(AB13,FIND(\"-\",AB13)+1,LEN(AB13)-FIND(\"-\",AB13)-1)-0))","v":""},{"$f":"IF(OR(ISERROR(FIND(\"-\",AC13)),AQ13<='export html'!$AR$7),\"\",IF(RIGHT(AC13)<>\"*\",MID(AC13,FIND(\"-\",AC13)+1,LEN(AC13)-FIND(\"-\",AC13))-0,MID(AC13,FIND(\"-\",AC13)+1,LEN(AC13)-FIND(\"-\",AC13)-1)-0))","v":""},{"$f":"IF(OR(ISERROR(FIND(\"-\",AD13)),AR13<='export html'!$AR$7),\"\",IF(RIGHT(AD13)<>\"*\",MID(AD13,FIND(\"-\",AD13)+1,LEN(AD13)-FIND(\"-\",AD13))-0,MID(AD13,FIND(\"-\",AD13)+1,LEN(AD13)-FIND(\"-\",AD13)-1)-0))","v":""},9]
[null,null,null,null,null,null,null,null,null,null,null,null,null,null,null,null,null,null,null,null,null,null,null,null,null,null,null,null,null,null,null,null,null,null,null,null,null,null,null,null,null,null,null,null,null,null,null,null,null,null,null,null,null,null,null,null,null,null,null,null,null,null,null,null,null,null,null,null,null,null,null,null,null,10,{"$f":"IF(OR(ISERROR(FIND(\"-\",Q14)),AE14>'export html'!$AR$7),\"\",IF(RIGHT(Q14)<>\"*\",MID(Q14,FIND(\"-\",Q14)+1,LEN(Q14)-FIND(\"-\",Q14))-0,MID(Q14,FIND(\"-\",Q14)+1,LEN(Q14)-FIND(\"-\",Q14)-1)-0))","v":5},{"$f":"IF(OR(ISERROR(FIND(\"-\",R14)),AF14>'export html'!$AR$7),\"\",IF(RIGHT(R14)<>\"*\",MID(R14,FIND(\"-\",R14)+1,LEN(R14)-FIND(\"-\",R14))-0,MID(R14,FIND(\"-\",R14)+1,LEN(R14)-FIND(\"-\",R14)-1)-0))","v":""},{"$f":"IF(OR(ISERROR(FIND(\"-\",S14)),AG14>'export html'!$AR$7),\"\",IF(RIGHT(S14)<>\"*\",MID(S14,FIND(\"-\",S14)+1,LEN(S14)-FIND(\"-\",S14))-0,MID(S14,FIND(\"-\",S14)+1,LEN(S14)-FIND(\"-\",S14)-1)-0))","v":4},{"$f":"IF(OR(ISERROR(FIND(\"-\",T14)),AH14>'export html'!$AR$7),\"\",IF(RIGHT(T14)<>\"*\",MID(T14,FIND(\"-\",T14)+1,LEN(T14)-FIND(\"-\",T14))-0,MID(T14,FIND(\"-\",T14)+1,LEN(T14)-FIND(\"-\",T14)-1)-0))","v":""},{"$f":"IF(OR(ISERROR(FIND(\"-\",U14)),AI14>'export html'!$AR$7),\"\",IF(RIGHT(U14)<>\"*\",MID(U14,FIND(\"-\",U14)+1,LEN(U14)-FIND(\"-\",U14))-0,MID(U14,FIND(\"-\",U14)+1,LEN(U14)-FIND(\"-\",U14)-1)-0))","v":""},{"$f":"IF(OR(ISERROR(FIND(\"-\",V14)),AJ14>'export html'!$AR$7),\"\",IF(RIGHT(V14)<>\"*\",MID(V14,FIND(\"-\",V14)+1,LEN(V14)-FIND(\"-\",V14))-0,MID(V14,FIND(\"-\",V14)+1,LEN(V14)-FIND(\"-\",V14)-1)-0))","v":""},{"$f":"IF(OR(ISERROR(FIND(\"-\",W14)),AK14>'export html'!$AR$7),\"\",IF(RIGHT(W14)<>\"*\",MID(W14,FIND(\"-\",W14)+1,LEN(W14)-FIND(\"-\",W14))-0,MID(W14,FIND(\"-\",W14)+1,LEN(W14)-FIND(\"-\",W14)-1)-0))","v":""},{"$f":"IF(OR(ISERROR(FIND(\"-\",X14)),AL14>'export html'!$AR$7),\"\",IF(RIGHT(X14)<>\"*\",MID(X14,FIND(\"-\",X14)+1,LEN(X14)-FIND(\"-\",X14))-0,MID(X14,FIND(\"-\",X14)+1,LEN(X14)-FIND(\"-\",X14)-1)-0))","v":1},{"$f":"IF(OR(ISERROR(FIND(\"-\",Y14)),AM14>'export html'!$AR$7),\"\",IF(RIGHT(Y14)<>\"*\",MID(Y14,FIND(\"-\",Y14)+1,LEN(Y14)-FIND(\"-\",Y14))-0,MID(Y14,FIND(\"-\",Y14)+1,LEN(Y14)-FIND(\"-\",Y14)-1)-0))","v":""},null,{"$f":"IF(OR(ISERROR(FIND(\"-\",AA14)),AO14>'export html'!$AR$7),\"\",IF(RIGHT(AA14)<>\"*\",MID(AA14,FIND(\"-\",AA14)+1,LEN(AA14)-FIND(\"-\",AA14))-0,MID(AA14,FIND(\"-\",AA14)+1,LEN(AA14)-FIND(\"-\",AA14)-1)-0))","v":""},{"$f":"IF(OR(ISERROR(FIND(\"-\",AB14)),AP14>'export html'!$AR$7),\"\",IF(RIGHT(AB14)<>\"*\",MID(AB14,FIND(\"-\",AB14)+1,LEN(AB14)-FIND(\"-\",AB14))-0,MID(AB14,FIND(\"-\",AB14)+1,LEN(AB14)-FIND(\"-\",AB14)-1)-0))","v":""},{"$f":"IF(OR(ISERROR(FIND(\"-\",AC14)),AQ14>'export html'!$AR$7),\"\",IF(RIGHT(AC14)<>\"*\",MID(AC14,FIND(\"-\",AC14)+1,LEN(AC14)-FIND(\"-\",AC14))-0,MID(AC14,FIND(\"-\",AC14)+1,LEN(AC14)-FIND(\"-\",AC14)-1)-0))","v":""},{"$f":"IF(OR(ISERROR(FIND(\"-\",AD14)),AR14>'export html'!$AR$7),\"\",IF(RIGHT(AD14)<>\"*\",MID(AD14,FIND(\"-\",AD14)+1,LEN(AD14)-FIND(\"-\",AD14))-0,MID(AD14,FIND(\"-\",AD14)+1,LEN(AD14)-FIND(\"-\",AD14)-1)-0))","v":""},10,{"$f":"IF(OR(ISERROR(FIND(\"-\",Q14)),AE14<='export html'!$AR$7),\"\",IF(RIGHT(Q14)<>\"*\",MID(Q14,FIND(\"-\",Q14)+1,LEN(Q14)-FIND(\"-\",Q14))-0,MID(Q14,FIND(\"-\",Q14)+1,LEN(Q14)-FIND(\"-\",Q14)-1)-0))","v":""},{"$f":"IF(OR(ISERROR(FIND(\"-\",R14)),AF14<='export html'!$AR$7),\"\",IF(RIGHT(R14)<>\"*\",MID(R14,FIND(\"-\",R14)+1,LEN(R14)-FIND(\"-\",R14))-0,MID(R14,FIND(\"-\",R14)+1,LEN(R14)-FIND(\"-\",R14)-1)-0))","v":""},{"$f":"IF(OR(ISERROR(FIND(\"-\",S14)),AG14<='export html'!$AR$7),\"\",IF(RIGHT(S14)<>\"*\",MID(S14,FIND(\"-\",S14)+1,LEN(S14)-FIND(\"-\",S14))-0,MID(S14,FIND(\"-\",S14)+1,LEN(S14)-FIND(\"-\",S14)-1)-0))","v":""},{"$f":"IF(OR(ISERROR(FIND(\"-\",T14)),AH14<='export html'!$AR$7),\"\",IF(RIGHT(T14)<>\"*\",MID(T14,FIND(\"-\",T14)+1,LEN(T14)-FIND(\"-\",T14))-0,MID(T14,FIND(\"-\",T14)+1,LEN(T14)-FIND(\"-\",T14)-1)-0))","v":""},{"$f":"IF(OR(ISERROR(FIND(\"-\",U14)),AI14<='export html'!$AR$7),\"\",IF(RIGHT(U14)<>\"*\",MID(U14,FIND(\"-\",U14)+1,LEN(U14)-FIND(\"-\",U14))-0,MID(U14,FIND(\"-\",U14)+1,LEN(U14)-FIND(\"-\",U14)-1)-0))","v":""},{"$f":"IF(OR(ISERROR(FIND(\"-\",V14)),AJ14<='export html'!$AR$7),\"\",IF(RIGHT(V14)<>\"*\",MID(V14,FIND(\"-\",V14)+1,LEN(V14)-FIND(\"-\",V14))-0,MID(V14,FIND(\"-\",V14)+1,LEN(V14)-FIND(\"-\",V14)-1)-0))","v":""},{"$f":"IF(OR(ISERROR(FIND(\"-\",W14)),AK14<='export html'!$AR$7),\"\",IF(RIGHT(W14)<>\"*\",MID(W14,FIND(\"-\",W14)+1,LEN(W14)-FIND(\"-\",W14))-0,MID(W14,FIND(\"-\",W14)+1,LEN(W14)-FIND(\"-\",W14)-1)-0))","v":""},{"$f":"IF(OR(ISERROR(FIND(\"-\",X14)),AL14<='export html'!$AR$7),\"\",IF(RIGHT(X14)<>\"*\",MID(X14,FIND(\"-\",X14)+1,LEN(X14)-FIND(\"-\",X14))-0,MID(X14,FIND(\"-\",X14)+1,LEN(X14)-FIND(\"-\",X14)-1)-0))","v":""},{"$f":"IF(OR(ISERROR(FIND(\"-\",Y14)),AM14<='export html'!$AR$7),\"\",IF(RIGHT(Y14)<>\"*\",MID(Y14,FIND(\"-\",Y14)+1,LEN(Y14)-FIND(\"-\",Y14))-0,MID(Y14,FIND(\"-\",Y14)+1,LEN(Y14)-FIND(\"-\",Y14)-1)-0))","v":""},null,{"$f":"IF(OR(ISERROR(FIND(\"-\",AA14)),AO14<='export html'!$AR$7),\"\",IF(RIGHT(AA14)<>\"*\",MID(AA14,FIND(\"-\",AA14)+1,LEN(AA14)-FIND(\"-\",AA14))-0,MID(AA14,FIND(\"-\",AA14)+1,LEN(AA14)-FIND(\"-\",AA14)-1)-0))","v":""},{"$f":"IF(OR(ISERROR(FIND(\"-\",AB14)),AP14<='export html'!$AR$7),\"\",IF(RIGHT(AB14)<>\"*\",MID(AB14,FIND(\"-\",AB14)+1,LEN(AB14)-FIND(\"-\",AB14))-0,MID(AB14,FIND(\"-\",AB14)+1,LEN(AB14)-FIND(\"-\",AB14)-1)-0))","v":""},{"$f":"IF(OR(ISERROR(FIND(\"-\",AC14)),AQ14<='export html'!$AR$7),\"\",IF(RIGHT(AC14)<>\"*\",MID(AC14,FIND(\"-\",AC14)+1,LEN(AC14)-FIND(\"-\",AC14))-0,MID(AC14,FIND(\"-\",AC14)+1,LEN(AC14)-FIND(\"-\",AC14)-1)-0))","v":""},{"$f":"IF(OR(ISERROR(FIND(\"-\",AD14)),AR14<='export html'!$AR$7),\"\",IF(RIGHT(AD14)<>\"*\",MID(AD14,FIND(\"-\",AD14)+1,LEN(AD14)-FIND(\"-\",AD14))-0,MID(AD14,FIND(\"-\",AD14)+1,LEN(AD14)-FIND(\"-\",AD14)-1)-0))","v":""},10]
[null,null,null,null,null,null,null,null,null,null,null,null,null,null,null,null,null,null,null,null,null,null,null,null,null,null,null,null,null,null,null,null,null,null,null,null,null,null,null,null,null,null,null,null,null,null,null,null,null,null,null,null,null,null,null,null,null,null,null,null,null,null,null,null,null,null,null,null,null,null,null,null,null,11,{"$f":"IF(OR(ISERROR(FIND(\"-\",Q15)),AE15>'export html'!$AR$7),\"\",IF(RIGHT(Q15)<>\"*\",MID(Q15,FIND(\"-\",Q15)+1,LEN(Q15)-FIND(\"-\",Q15))-0,MID(Q15,FIND(\"-\",Q15)+1,LEN(Q15)-FIND(\"-\",Q15)-1)-0))","v":""},{"$f":"IF(OR(ISERROR(FIND(\"-\",R15)),AF15>'export html'!$AR$7),\"\",IF(RIGHT(R15)<>\"*\",MID(R15,FIND(\"-\",R15)+1,LEN(R15)-FIND(\"-\",R15))-0,MID(R15,FIND(\"-\",R15)+1,LEN(R15)-FIND(\"-\",R15)-1)-0))","v":""},{"$f":"IF(OR(ISERROR(FIND(\"-\",S15)),AG15>'export html'!$AR$7),\"\",IF(RIGHT(S15)<>\"*\",MID(S15,FIND(\"-\",S15)+1,LEN(S15)-FIND(\"-\",S15))-0,MID(S15,FIND(\"-\",S15)+1,LEN(S15)-FIND(\"-\",S15)-1)-0))","v":0},{"$f":"IF(OR(ISERROR(FIND(\"-\",T15)),AH15>'export html'!$AR$7),\"\",IF(RIGHT(T15)<>\"*\",MID(T15,FIND(\"-\",T15)+1,LEN(T15)-FIND(\"-\",T15))-0,MID(T15,FIND(\"-\",T15)+1,LEN(T15)-FIND(\"-\",T15)-1)-0))","v":5},{"$f":"IF(OR(ISERROR(FIND(\"-\",U15)),AI15>'export html'!$AR$7),\"\",IF(RIGHT(U15)<>\"*\",MID(U15,FIND(\"-\",U15)+1,LEN(U15)-FIND(\"-\",U15))-0,MID(U15,FIND(\"-\",U15)+1,LEN(U15)-FIND(\"-\",U15)-1)-0))","v":""},{"$f":"IF(OR(ISERROR(FIND(\"-\",V15)),AJ15>'export html'!$AR$7),\"\",IF(RIGHT(V15)<>\"*\",MID(V15,FIND(\"-\",V15)+1,LEN(V15)-FIND(\"-\",V15))-0,MID(V15,FIND(\"-\",V15)+1,LEN(V15)-FIND(\"-\",V15)-1)-0))","v":""},{"$f":"IF(OR(ISERROR(FIND(\"-\",W15)),AK15>'export html'!$AR$7),\"\",IF(RIGHT(W15)<>\"*\",MID(W15,FIND(\"-\",W15)+1,LEN(W15)-FIND(\"-\",W15))-0,MID(W15,FIND(\"-\",W15)+1,LEN(W15)-FIND(\"-\",W15)-1)-0))","v":""},{"$f":"IF(OR(ISERROR(FIND(\"-\",X15)),AL15>'export html'!$AR$7),\"\",IF(RIGHT(X15)<>\"*\",MID(X15,FIND(\"-\",X15)+1,LEN(X15)-FIND(\"-\",X15))-0,MID(X15,FIND(\"-\",X15)+1,LEN(X15)-FIND(\"-\",X15)-1)-0))","v":""},{"$f":"IF(OR(ISERROR(FIND(\"-\",Y15)),AM15>'export html'!$AR$7),\"\",IF(RIGHT(Y15)<>\"*\",MID(Y15,FIND(\"-\",Y15)+1,LEN(Y15)-FIND(\"-\",Y15))-0,MID(Y15,FIND(\"-\",Y15)+1,LEN(Y15)-FIND(\"-\",Y15)-1)-0))","v":1},{"$f":"IF(OR(ISERROR(FIND(\"-\",Z15)),AN15>'export html'!$AR$7),\"\",IF(RIGHT(Z15)<>\"*\",MID(Z15,FIND(\"-\",Z15)+1,LEN(Z15)-FIND(\"-\",Z15))-0,MID(Z15,FIND(\"-\",Z15)+1,LEN(Z15)-FIND(\"-\",Z15)-1)-0))","v":""},null,{"$f":"IF(OR(ISERROR(FIND(\"-\",AB15)),AP15>'export html'!$AR$7),\"\",IF(RIGHT(AB15)<>\"*\",MID(AB15,FIND(\"-\",AB15)+1,LEN(AB15)-FIND(\"-\",AB15))-0,MID(AB15,FIND(\"-\",AB15)+1,LEN(AB15)-FIND(\"-\",AB15)-1)-0))","v":""},{"$f":"IF(OR(ISERROR(FIND(\"-\",AC15)),AQ15>'export html'!$AR$7),\"\",IF(RIGHT(AC15)<>\"*\",MID(AC15,FIND(\"-\",AC15)+1,LEN(AC15)-FIND(\"-\",AC15))-0,MID(AC15,FIND(\"-\",AC15)+1,LEN(AC15)-FIND(\"-\",AC15)-1)-0))","v":""},{"$f":"IF(OR(ISERROR(FIND(\"-\",AD15)),AR15>'export html'!$AR$7),\"\",IF(RIGHT(AD15)<>\"*\",MID(AD15,FIND(\"-\",AD15)+1,LEN(AD15)-FIND(\"-\",AD15))-0,MID(AD15,FIND(\"-\",AD15)+1,LEN(AD15)-FIND(\"-\",AD15)-1)-0))","v":""},11,{"$f":"IF(OR(ISERROR(FIND(\"-\",Q15)),AE15<='export html'!$AR$7),\"\",IF(RIGHT(Q15)<>\"*\",MID(Q15,FIND(\"-\",Q15)+1,LEN(Q15)-FIND(\"-\",Q15))-0,MID(Q15,FIND(\"-\",Q15)+1,LEN(Q15)-FIND(\"-\",Q15)-1)-0))","v":""},{"$f":"IF(OR(ISERROR(FIND(\"-\",R15)),AF15<='export html'!$AR$7),\"\",IF(RIGHT(R15)<>\"*\",MID(R15,FIND(\"-\",R15)+1,LEN(R15)-FIND(\"-\",R15))-0,MID(R15,FIND(\"-\",R15)+1,LEN(R15)-FIND(\"-\",R15)-1)-0))","v":""},{"$f":"IF(OR(ISERROR(FIND(\"-\",S15)),AG15<='export html'!$AR$7),\"\",IF(RIGHT(S15)<>\"*\",MID(S15,FIND(\"-\",S15)+1,LEN(S15)-FIND(\"-\",S15))-0,MID(S15,FIND(\"-\",S15)+1,LEN(S15)-FIND(\"-\",S15)-1)-0))","v":""},{"$f":"IF(OR(ISERROR(FIND(\"-\",T15)),AH15<='export html'!$AR$7),\"\",IF(RIGHT(T15)<>\"*\",MID(T15,FIND(\"-\",T15)+1,LEN(T15)-FIND(\"-\",T15))-0,MID(T15,FIND(\"-\",T15)+1,LEN(T15)-FIND(\"-\",T15)-1)-0))","v":""},{"$f":"IF(OR(ISERROR(FIND(\"-\",U15)),AI15<='export html'!$AR$7),\"\",IF(RIGHT(U15)<>\"*\",MID(U15,FIND(\"-\",U15)+1,LEN(U15)-FIND(\"-\",U15))-0,MID(U15,FIND(\"-\",U15)+1,LEN(U15)-FIND(\"-\",U15)-1)-0))","v":""},{"$f":"IF(OR(ISERROR(FIND(\"-\",V15)),AJ15<='export html'!$AR$7),\"\",IF(RIGHT(V15)<>\"*\",MID(V15,FIND(\"-\",V15)+1,LEN(V15)-FIND(\"-\",V15))-0,MID(V15,FIND(\"-\",V15)+1,LEN(V15)-FIND(\"-\",V15)-1)-0))","v":""},{"$f":"IF(OR(ISERROR(FIND(\"-\",W15)),AK15<='export html'!$AR$7),\"\",IF(RIGHT(W15)<>\"*\",MID(W15,FIND(\"-\",W15)+1,LEN(W15)-FIND(\"-\",W15))-0,MID(W15,FIND(\"-\",W15)+1,LEN(W15)-FIND(\"-\",W15)-1)-0))","v":""},{"$f":"IF(OR(ISERROR(FIND(\"-\",X15)),AL15<='export html'!$AR$7),\"\",IF(RIGHT(X15)<>\"*\",MID(X15,FIND(\"-\",X15)+1,LEN(X15)-FIND(\"-\",X15))-0,MID(X15,FIND(\"-\",X15)+1,LEN(X15)-FIND(\"-\",X15)-1)-0))","v":""},{"$f":"IF(OR(ISERROR(FIND(\"-\",Y15)),AM15<='export html'!$AR$7),\"\",IF(RIGHT(Y15)<>\"*\",MID(Y15,FIND(\"-\",Y15)+1,LEN(Y15)-FIND(\"-\",Y15))-0,MID(Y15,FIND(\"-\",Y15)+1,LEN(Y15)-FIND(\"-\",Y15)-1)-0))","v":""},{"$f":"IF(OR(ISERROR(FIND(\"-\",Z15)),AN15<='export html'!$AR$7),\"\",IF(RIGHT(Z15)<>\"*\",MID(Z15,FIND(\"-\",Z15)+1,LEN(Z15)-FIND(\"-\",Z15))-0,MID(Z15,FIND(\"-\",Z15)+1,LEN(Z15)-FIND(\"-\",Z15)-1)-0))","v":""},null,{"$f":"IF(OR(ISERROR(FIND(\"-\",AB15)),AP15<='export html'!$AR$7),\"\",IF(RIGHT(AB15)<>\"*\",MID(AB15,FIND(\"-\",AB15)+1,LEN(AB15)-FIND(\"-\",AB15))-0,MID(AB15,FIND(\"-\",AB15)+1,LEN(AB15)-FIND(\"-\",AB15)-1)-0))","v":""},{"$f":"IF(OR(ISERROR(FIND(\"-\",AC15)),AQ15<='export html'!$AR$7),\"\",IF(RIGHT(AC15)<>\"*\",MID(AC15,FIND(\"-\",AC15)+1,LEN(AC15)-FIND(\"-\",AC15))-0,MID(AC15,FIND(\"-\",AC15)+1,LEN(AC15)-FIND(\"-\",AC15)-1)-0))","v":""},{"$f":"IF(OR(ISERROR(FIND(\"-\",AD15)),AR15<='export html'!$AR$7),\"\",IF(RIGHT(AD15)<>\"*\",MID(AD15,FIND(\"-\",AD15)+1,LEN(AD15)-FIND(\"-\",AD15))-0,MID(AD15,FIND(\"-\",AD15)+1,LEN(AD15)-FIND(\"-\",AD15)-1)-0))","v":""},11]
[null,null,null,{"$f":"'export html'!C2","v":"Matchen van speeldag 6"},null,6,null,null,null,null,null,null,null,null,null,null,null,null,null,null,null,null,null,null,null,null,null,null,null,null,null,null,null,null,null,null,null,null,null,null,null,null,null,null,null,null,null,null,null,null,null,null,null,null,null,null,null,null,null,null,null,null,null,null,null,null,null,null,null,null,null,null,null,12,{"$f":"IF(OR(ISERROR(FIND(\"-\",Q16)),AE16>'export html'!$AR$7),\"\",IF(RIGHT(Q16)<>\"*\",MID(Q16,FIND(\"-\",Q16)+1,LEN(Q16)-FIND(\"-\",Q16))-0,MID(Q16,FIND(\"-\",Q16)+1,LEN(Q16)-FIND(\"-\",Q16)-1)-0))","v":""},{"$f":"IF(OR(ISERROR(FIND(\"-\",R16)),AF16>'export html'!$AR$7),\"\",IF(RIGHT(R16)<>\"*\",MID(R16,FIND(\"-\",R16)+1,LEN(R16)-FIND(\"-\",R16))-0,MID(R16,FIND(\"-\",R16)+1,LEN(R16)-FIND(\"-\",R16)-1)-0))","v":""},{"$f":"IF(OR(ISERROR(FIND(\"-\",S16)),AG16>'export html'!$AR$7),\"\",IF(RIGHT(S16)<>\"*\",MID(S16,FIND(\"-\",S16)+1,LEN(S16)-FIND(\"-\",S16))-0,MID(S16,FIND(\"-\",S16)+1,LEN(S16)-FIND(\"-\",S16)-1)-0))","v":""},{"$f":"IF(OR(ISERROR(FIND(\"-\",T16)),AH16>'export html'!$AR$7),\"\",IF(RIGHT(T16)<>\"*\",MID(T16,FIND(\"-\",T16)+1,LEN(T16)-FIND(\"-\",T16))-0,MID(T16,FIND(\"-\",T16)+1,LEN(T16)-FIND(\"-\",T16)-1)-0))","v":""},{"$f":"IF(OR(ISERROR(FIND(\"-\",U16)),AI16>'export html'!$AR$7),\"\",IF(RIGHT(U16)<>\"*\",MID(U16,FIND(\"-\",U16)+1,LEN(U16)-FIND(\"-\",U16))-0,MID(U16,FIND(\"-\",U16)+1,LEN(U16)-FIND(\"-\",U16)-1)-0))","v":""},{"$f":"IF(OR(ISERROR(FIND(\"-\",V16)),AJ16>'export html'!$AR$7),\"\",IF(RIGHT(V16)<>\"*\",MID(V16,FIND(\"-\",V16)+1,LEN(V16)-FIND(\"-\",V16))-0,MID(V16,FIND(\"-\",V16)+1,LEN(V16)-FIND(\"-\",V16)-1)-0))","v":3},{"$f":"IF(OR(ISERROR(FIND(\"-\",W16)),AK16>'export html'!$AR$7),\"\",IF(RIGHT(W16)<>\"*\",MID(W16,FIND(\"-\",W16)+1,LEN(W16)-FIND(\"-\",W16))-0,MID(W16,FIND(\"-\",W16)+1,LEN(W16)-FIND(\"-\",W16)-1)-0))","v":2},{"$f":"IF(OR(ISERROR(FIND(\"-\",X16)),AL16>'export html'!$AR$7),\"\",IF(RIGHT(X16)<>\"*\",MID(X16,FIND(\"-\",X16)+1,LEN(X16)-FIND(\"-\",X16))-0,MID(X16,FIND(\"-\",X16)+1,LEN(X16)-FIND(\"-\",X16)-1)-0))","v":""},{"$f":"IF(OR(ISERROR(FIND(\"-\",Y16)),AM16>'export html'!$AR$7),\"\",IF(RIGHT(Y16)<>\"*\",MID(Y16,FIND(\"-\",Y16)+1,LEN(Y16)-FIND(\"-\",Y16))-0,MID(Y16,FIND(\"-\",Y16)+1,LEN(Y16)-FIND(\"-\",Y16)-1)-0))","v":""},{"$f":"IF(OR(ISERROR(FIND(\"-\",Z16)),AN16>'export html'!$AR$7),\"\",IF(RIGHT(Z16)<>\"*\",MID(Z16,FIND(\"-\",Z16)+1,LEN(Z16)-FIND(\"-\",Z16))-0,MID(Z16,FIND(\"-\",Z16)+1,LEN(Z16)-FIND(\"-\",Z16)-1)-0))","v":""},{"$f":"IF(OR(ISERROR(FIND(\"-\",AA16)),AO16>'export html'!$AR$7),\"\",IF(RIGHT(AA16)<>\"*\",MID(AA16,FIND(\"-\",AA16)+1,LEN(AA16)-FIND(\"-\",AA16))-0,MID(AA16,FIND(\"-\",AA16)+1,LEN(AA16)-FIND(\"-\",AA16)-1)-0))","v":""},null,{"$f":"IF(OR(ISERROR(FIND(\"-\",AC16)),AQ16>'export html'!$AR$7),\"\",IF(RIGHT(AC16)<>\"*\",MID(AC16,FIND(\"-\",AC16)+1,LEN(AC16)-FIND(\"-\",AC16))-0,MID(AC16,FIND(\"-\",AC16)+1,LEN(AC16)-FIND(\"-\",AC16)-1)-0))","v":3},{"$f":"IF(OR(ISERROR(FIND(\"-\",AD16)),AR16>'export html'!$AR$7),\"\",IF(RIGHT(AD16)<>\"*\",MID(AD16,FIND(\"-\",AD16)+1,LEN(AD16)-FIND(\"-\",AD16))-0,MID(AD16,FIND(\"-\",AD16)+1,LEN(AD16)-FIND(\"-\",AD16)-1)-0))","v":""},12,{"$f":"IF(OR(ISERROR(FIND(\"-\",Q16)),AE16<='export html'!$AR$7),\"\",IF(RIGHT(Q16)<>\"*\",MID(Q16,FIND(\"-\",Q16)+1,LEN(Q16)-FIND(\"-\",Q16))-0,MID(Q16,FIND(\"-\",Q16)+1,LEN(Q16)-FIND(\"-\",Q16)-1)-0))","v":""},{"$f":"IF(OR(ISERROR(FIND(\"-\",R16)),AF16<='export html'!$AR$7),\"\",IF(RIGHT(R16)<>\"*\",MID(R16,FIND(\"-\",R16)+1,LEN(R16)-FIND(\"-\",R16))-0,MID(R16,FIND(\"-\",R16)+1,LEN(R16)-FIND(\"-\",R16)-1)-0))","v":""},{"$f":"IF(OR(ISERROR(FIND(\"-\",S16)),AG16<='export html'!$AR$7),\"\",IF(RIGHT(S16)<>\"*\",MID(S16,FIND(\"-\",S16)+1,LEN(S16)-FIND(\"-\",S16))-0,MID(S16,FIND(\"-\",S16)+1,LEN(S16)-FIND(\"-\",S16)-1)-0))","v":""},{"$f":"IF(OR(ISERROR(FIND(\"-\",T16)),AH16<='export html'!$AR$7),\"\",IF(RIGHT(T16)<>\"*\",MID(T16,FIND(\"-\",T16)+1,LEN(T16)-FIND(\"-\",T16))-0,MID(T16,FIND(\"-\",T16)+1,LEN(T16)-FIND(\"-\",T16)-1)-0))","v":""},{"$f":"IF(OR(ISERROR(FIND(\"-\",U16)),AI16<='export html'!$AR$7),\"\",IF(RIGHT(U16)<>\"*\",MID(U16,FIND(\"-\",U16)+1,LEN(U16)-FIND(\"-\",U16))-0,MID(U16,FIND(\"-\",U16)+1,LEN(U16)-FIND(\"-\",U16)-1)-0))","v":""},{"$f":"IF(OR(ISERROR(FIND(\"-\",V16)),AJ16<='export html'!$AR$7),\"\",IF(RIGHT(V16)<>\"*\",MID(V16,FIND(\"-\",V16)+1,LEN(V16)-FIND(\"-\",V16))-0,MID(V16,FIND(\"-\",V16)+1,LEN(V16)-FIND(\"-\",V16)-1)-0))","v":""},{"$f":"IF(OR(ISERROR(FIND(\"-\",W16)),AK16<='export html'!$AR$7),\"\",IF(RIGHT(W16)<>\"*\",MID(W16,FIND(\"-\",W16)+1,LEN(W16)-FIND(\"-\",W16))-0,MID(W16,FIND(\"-\",W16)+1,LEN(W16)-FIND(\"-\",W16)-1)-0))","v":""},{"$f":"IF(OR(ISERROR(FIND(\"-\",X16)),AL16<='export html'!$AR$7),\"\",IF(RIGHT(X16)<>\"*\",MID(X16,FIND(\"-\",X16)+1,LEN(X16)-FIND(\"-\",X16))-0,MID(X16,FIND(\"-\",X16)+1,LEN(X16)-FIND(\"-\",X16)-1)-0))","v":""},{"$f":"IF(OR(ISERROR(FIND(\"-\",Y16)),AM16<='export html'!$AR$7),\"\",IF(RIGHT(Y16)<>\"*\",MID(Y16,FIND(\"-\",Y16)+1,LEN(Y16)-FIND(\"-\",Y16))-0,MID(Y16,FIND(\"-\",Y16)+1,LEN(Y16)-FIND(\"-\",Y16)-1)-0))","v":""},{"$f":"IF(OR(ISERROR(FIND(\"-\",Z16)),AN16<='export html'!$AR$7),\"\",IF(RIGHT(Z16)<>\"*\",MID(Z16,FIND(\"-\",Z16)+1,LEN(Z16)-FIND(\"-\",Z16))-0,MID(Z16,FIND(\"-\",Z16)+1,LEN(Z16)-FIND(\"-\",Z16)-1)-0))","v":""},{"$f":"IF(OR(ISERROR(FIND(\"-\",AA16)),AO16<='export html'!$AR$7),\"\",IF(RIGHT(AA16)<>\"*\",MID(AA16,FIND(\"-\",AA16)+1,LEN(AA16)-FIND(\"-\",AA16))-0,MID(AA16,FIND(\"-\",AA16)+1,LEN(AA16)-FIND(\"-\",AA16)-1)-0))","v":""},null,{"$f":"IF(OR(ISERROR(FIND(\"-\",AC16)),AQ16<='export html'!$AR$7),\"\",IF(RIGHT(AC16)<>\"*\",MID(AC16,FIND(\"-\",AC16)+1,LEN(AC16)-FIND(\"-\",AC16))-0,MID(AC16,FIND(\"-\",AC16)+1,LEN(AC16)-FIND(\"-\",AC16)-1)-0))","v":""},{"$f":"IF(OR(ISERROR(FIND(\"-\",AD16)),AR16<='export html'!$AR$7),\"\",IF(RIGHT(AD16)<>\"*\",MID(AD16,FIND(\"-\",AD16)+1,LEN(AD16)-FIND(\"-\",AD16))-0,MID(AD16,FIND(\"-\",AD16)+1,LEN(AD16)-FIND(\"-\",AD16)-1)-0))","v":""},12]
[null,null,null,null,null,null,null,null,null,null,null,null,null,null,null,null,null,null,null,null,null,null,null,null,null,null,null,null,null,null,null,null,null,null,null,null,null,null,null,null,null,null,null,null,null,null,null,null,null,null,null,null,null,null,null,null,null,null,null,null,null,null,null,null,null,null,null,null,null,null,null,null,null,13,{"$f":"IF(OR(ISERROR(FIND(\"-\",Q17)),AE17>'export html'!$AR$7),\"\",IF(RIGHT(Q17)<>\"*\",MID(Q17,FIND(\"-\",Q17)+1,LEN(Q17)-FIND(\"-\",Q17))-0,MID(Q17,FIND(\"-\",Q17)+1,LEN(Q17)-FIND(\"-\",Q17)-1)-0))","v":""},{"$f":"IF(OR(ISERROR(FIND(\"-\",R17)),AF17>'export html'!$AR$7),\"\",IF(RIGHT(R17)<>\"*\",MID(R17,FIND(\"-\",R17)+1,LEN(R17)-FIND(\"-\",R17))-0,MID(R17,FIND(\"-\",R17)+1,LEN(R17)-FIND(\"-\",R17)-1)-0))","v":""},{"$f":"IF(OR(ISERROR(FIND(\"-\",S17)),AG17>'export html'!$AR$7),\"\",IF(RIGHT(S17)<>\"*\",MID(S17,FIND(\"-\",S17)+1,LEN(S17)-FIND(\"-\",S17))-0,MID(S17,FIND(\"-\",S17)+1,LEN(S17)-FIND(\"-\",S17)-1)-0))","v":""},{"$f":"IF(OR(ISERROR(FIND(\"-\",T17)),AH17>'export html'!$AR$7),\"\",IF(RIGHT(T17)<>\"*\",MID(T17,FIND(\"-\",T17)+1,LEN(T17)-FIND(\"-\",T17))-0,MID(T17,FIND(\"-\",T17)+1,LEN(T17)-FIND(\"-\",T17)-1)-0))","v":1},{"$f":"IF(OR(ISERROR(FIND(\"-\",U17)),AI17>'export html'!$AR$7),\"\",IF(RIGHT(U17)<>\"*\",MID(U17,FIND(\"-\",U17)+1,LEN(U17)-FIND(\"-\",U17))-0,MID(U17,FIND(\"-\",U17)+1,LEN(U17)-FIND(\"-\",U17)-1)-0))","v":3},{"$f":"IF(OR(ISERROR(FIND(\"-\",V17)),AJ17>'export html'!$AR$7),\"\",IF(RIGHT(V17)<>\"*\",MID(V17,FIND(\"-\",V17)+1,LEN(V17)-FIND(\"-\",V17))-0,MID(V17,FIND(\"-\",V17)+1,LEN(V17)-FIND(\"-\",V17)-1)-0))","v":""},{"$f":"IF(OR(ISERROR(FIND(\"-\",W17)),AK17>'export html'!$AR$7),\"\",IF(RIGHT(W17)<>\"*\",MID(W17,FIND(\"-\",W17)+1,LEN(W17)-FIND(\"-\",W17))-0,MID(W17,FIND(\"-\",W17)+1,LEN(W17)-FIND(\"-\",W17)-1)-0))","v":""},{"$f":"IF(OR(ISERROR(FIND(\"-\",X17)),AL17>'export html'!$AR$7),\"\",IF(RIGHT(X17)<>\"*\",MID(X17,FIND(\"-\",X17)+1,LEN(X17)-FIND(\"-\",X17))-0,MID(X17,FIND(\"-\",X17)+1,LEN(X17)-FIND(\"-\",X17)-1)-0))","v":""},{"$f":"IF(OR(ISERROR(FIND(\"-\",Y17)),AM17>'export html'!$AR$7),\"\",IF(RIGHT(Y17)<>\"*\",MID(Y17,FIND(\"-\",Y17)+1,LEN(Y17)-FIND(\"-\",Y17))-0,MID(Y17,FIND(\"-\",Y17)+1,LEN(Y17)-FIND(\"-\",Y17)-1)-0))","v":""},{"$f":"IF(OR(ISERROR(FIND(\"-\",Z17)),AN17>'export html'!$AR$7),\"\",IF(RIGHT(Z17)<>\"*\",MID(Z17,FIND(\"-\",Z17)+1,LEN(Z17)-FIND(\"-\",Z17))-0,MID(Z17,FIND(\"-\",Z17)+1,LEN(Z17)-FIND(\"-\",Z17)-1)-0))","v":1},{"$f":"IF(OR(ISERROR(FIND(\"-\",AA17)),AO17>'export html'!$AR$7),\"\",IF(RIGHT(AA17)<>\"*\",MID(AA17,FIND(\"-\",AA17)+1,LEN(AA17)-FIND(\"-\",AA17))-0,MID(AA17,FIND(\"-\",AA17)+1,LEN(AA17)-FIND(\"-\",AA17)-1)-0))","v":""},{"$f":"IF(OR(ISERROR(FIND(\"-\",AB17)),AP17>'export html'!$AR$7),\"\",IF(RIGHT(AB17)<>\"*\",MID(AB17,FIND(\"-\",AB17)+1,LEN(AB17)-FIND(\"-\",AB17))-0,MID(AB17,FIND(\"-\",AB17)+1,LEN(AB17)-FIND(\"-\",AB17)-1)-0))","v":""},null,{"$f":"IF(OR(ISERROR(FIND(\"-\",AD17)),AR17>'export html'!$AR$7),\"\",IF(RIGHT(AD17)<>\"*\",MID(AD17,FIND(\"-\",AD17)+1,LEN(AD17)-FIND(\"-\",AD17))-0,MID(AD17,FIND(\"-\",AD17)+1,LEN(AD17)-FIND(\"-\",AD17)-1)-0))","v":""},13,{"$f":"IF(OR(ISERROR(FIND(\"-\",Q17)),AE17<='export html'!$AR$7),\"\",IF(RIGHT(Q17)<>\"*\",MID(Q17,FIND(\"-\",Q17)+1,LEN(Q17)-FIND(\"-\",Q17))-0,MID(Q17,FIND(\"-\",Q17)+1,LEN(Q17)-FIND(\"-\",Q17)-1)-0))","v":""},{"$f":"IF(OR(ISERROR(FIND(\"-\",R17)),AF17<='export html'!$AR$7),\"\",IF(RIGHT(R17)<>\"*\",MID(R17,FIND(\"-\",R17)+1,LEN(R17)-FIND(\"-\",R17))-0,MID(R17,FIND(\"-\",R17)+1,LEN(R17)-FIND(\"-\",R17)-1)-0))","v":""},{"$f":"IF(OR(ISERROR(FIND(\"-\",S17)),AG17<='export html'!$AR$7),\"\",IF(RIGHT(S17)<>\"*\",MID(S17,FIND(\"-\",S17)+1,LEN(S17)-FIND(\"-\",S17))-0,MID(S17,FIND(\"-\",S17)+1,LEN(S17)-FIND(\"-\",S17)-1)-0))","v":""},{"$f":"IF(OR(ISERROR(FIND(\"-\",T17)),AH17<='export html'!$AR$7),\"\",IF(RIGHT(T17)<>\"*\",MID(T17,FIND(\"-\",T17)+1,LEN(T17)-FIND(\"-\",T17))-0,MID(T17,FIND(\"-\",T17)+1,LEN(T17)-FIND(\"-\",T17)-1)-0))","v":""},{"$f":"IF(OR(ISERROR(FIND(\"-\",U17)),AI17<='export html'!$AR$7),\"\",IF(RIGHT(U17)<>\"*\",MID(U17,FIND(\"-\",U17)+1,LEN(U17)-FIND(\"-\",U17))-0,MID(U17,FIND(\"-\",U17)+1,LEN(U17)-FIND(\"-\",U17)-1)-0))","v":""},{"$f":"IF(OR(ISERROR(FIND(\"-\",V17)),AJ17<='export html'!$AR$7),\"\",IF(RIGHT(V17)<>\"*\",MID(V17,FIND(\"-\",V17)+1,LEN(V17)-FIND(\"-\",V17))-0,MID(V17,FIND(\"-\",V17)+1,LEN(V17)-FIND(\"-\",V17)-1)-0))","v":""},{"$f":"IF(OR(ISERROR(FIND(\"-\",W17)),AK17<='export html'!$AR$7),\"\",IF(RIGHT(W17)<>\"*\",MID(W17,FIND(\"-\",W17)+1,LEN(W17)-FIND(\"-\",W17))-0,MID(W17,FIND(\"-\",W17)+1,LEN(W17)-FIND(\"-\",W17)-1)-0))","v":""},{"$f":"IF(OR(ISERROR(FIND(\"-\",X17)),AL17<='export html'!$AR$7),\"\",IF(RIGHT(X17)<>\"*\",MID(X17,FIND(\"-\",X17)+1,LEN(X17)-FIND(\"-\",X17))-0,MID(X17,FIND(\"-\",X17)+1,LEN(X17)-FIND(\"-\",X17)-1)-0))","v":""},{"$f":"IF(OR(ISERROR(FIND(\"-\",Y17)),AM17<='export html'!$AR$7),\"\",IF(RIGHT(Y17)<>\"*\",MID(Y17,FIND(\"-\",Y17)+1,LEN(Y17)-FIND(\"-\",Y17))-0,MID(Y17,FIND(\"-\",Y17)+1,LEN(Y17)-FIND(\"-\",Y17)-1)-0))","v":""},{"$f":"IF(OR(ISERROR(FIND(\"-\",Z17)),AN17<='export html'!$AR$7),\"\",IF(RIGHT(Z17)<>\"*\",MID(Z17,FIND(\"-\",Z17)+1,LEN(Z17)-FIND(\"-\",Z17))-0,MID(Z17,FIND(\"-\",Z17)+1,LEN(Z17)-FIND(\"-\",Z17)-1)-0))","v":""},{"$f":"IF(OR(ISERROR(FIND(\"-\",AA17)),AO17<='export html'!$AR$7),\"\",IF(RIGHT(AA17)<>\"*\",MID(AA17,FIND(\"-\",AA17)+1,LEN(AA17)-FIND(\"-\",AA17))-0,MID(AA17,FIND(\"-\",AA17)+1,LEN(AA17)-FIND(\"-\",AA17)-1)-0))","v":""},{"$f":"IF(OR(ISERROR(FIND(\"-\",AB17)),AP17<='export html'!$AR$7),\"\",IF(RIGHT(AB17)<>\"*\",MID(AB17,FIND(\"-\",AB17)+1,LEN(AB17)-FIND(\"-\",AB17))-0,MID(AB17,FIND(\"-\",AB17)+1,LEN(AB17)-FIND(\"-\",AB17)-1)-0))","v":""},null,{"$f":"IF(OR(ISERROR(FIND(\"-\",AD17)),AR17<='export html'!$AR$7),\"\",IF(RIGHT(AD17)<>\"*\",MID(AD17,FIND(\"-\",AD17)+1,LEN(AD17)-FIND(\"-\",AD17))-0,MID(AD17,FIND(\"-\",AD17)+1,LEN(AD17)-FIND(\"-\",AD17)-1)-0))","v":""},13]
[null,null,null,{"$f":"IF('export html'!A3=\"\",\"\",'export html'!A3)","v":"2024-10-05"},{"$f":"IF('export html'!B3=\"\",\"\",'export html'!B3)","v":6},{"$f":"IF('export html'!C3=\"\",\"\",'export html'!C3)","v":"SC Duffel - Bariton"},null,null,null,null,null,null,null,{"$f":"IF('export html'!D3=\"\",\"\",'export html'!D3)","v":"1-1"},null,null,null,null,null,null,null,null,null,null,null,null,null,null,null,null,null,null,null,null,null,null,null,null,null,null,null,null,null,null,null,null,null,null,null,null,null,null,null,null,null,null,null,null,null,null,null,null,null,null,null,null,null,null,null,null,null,null,null,14,{"$f":"IF(OR(ISERROR(FIND(\"-\",Q18)),AE18>'export html'!$AR$7),\"\",IF(RIGHT(Q18)<>\"*\",MID(Q18,FIND(\"-\",Q18)+1,LEN(Q18)-FIND(\"-\",Q18))-0,MID(Q18,FIND(\"-\",Q18)+1,LEN(Q18)-FIND(\"-\",Q18)-1)-0))","v":""},{"$f":"IF(OR(ISERROR(FIND(\"-\",R18)),AF18>'export html'!$AR$7),\"\",IF(RIGHT(R18)<>\"*\",MID(R18,FIND(\"-\",R18)+1,LEN(R18)-FIND(\"-\",R18))-0,MID(R18,FIND(\"-\",R18)+1,LEN(R18)-FIND(\"-\",R18)-1)-0))","v":""},{"$f":"IF(OR(ISERROR(FIND(\"-\",S18)),AG18>'export html'!$AR$7),\"\",IF(RIGHT(S18)<>\"*\",MID(S18,FIND(\"-\",S18)+1,LEN(S18)-FIND(\"-\",S18))-0,MID(S18,FIND(\"-\",S18)+1,LEN(S18)-FIND(\"-\",S18)-1)-0))","v":""},{"$f":"IF(OR(ISERROR(FIND(\"-\",T18)),AH18>'export html'!$AR$7),\"\",IF(RIGHT(T18)<>\"*\",MID(T18,FIND(\"-\",T18)+1,LEN(T18)-FIND(\"-\",T18))-0,MID(T18,FIND(\"-\",T18)+1,LEN(T18)-FIND(\"-\",T18)-1)-0))","v":""},{"$f":"IF(OR(ISERROR(FIND(\"-\",U18)),AI18>'export html'!$AR$7),\"\",IF(RIGHT(U18)<>\"*\",MID(U18,FIND(\"-\",U18)+1,LEN(U18)-FIND(\"-\",U18))-0,MID(U18,FIND(\"-\",U18)+1,LEN(U18)-FIND(\"-\",U18)-1)-0))","v":""},{"$f":"IF(OR(ISERROR(FIND(\"-\",V18)),AJ18>'export html'!$AR$7),\"\",IF(RIGHT(V18)<>\"*\",MID(V18,FIND(\"-\",V18)+1,LEN(V18)-FIND(\"-\",V18))-0,MID(V18,FIND(\"-\",V18)+1,LEN(V18)-FIND(\"-\",V18)-1)-0))","v":""},{"$f":"IF(OR(ISERROR(FIND(\"-\",W18)),AK18>'export html'!$AR$7),\"\",IF(RIGHT(W18)<>\"*\",MID(W18,FIND(\"-\",W18)+1,LEN(W18)-FIND(\"-\",W18))-0,MID(W18,FIND(\"-\",W18)+1,LEN(W18)-FIND(\"-\",W18)-1)-0))","v":3},{"$f":"IF(OR(ISERROR(FIND(\"-\",X18)),AL18>'export html'!$AR$7),\"\",IF(RIGHT(X18)<>\"*\",MID(X18,FIND(\"-\",X18)+1,LEN(X18)-FIND(\"-\",X18))-0,MID(X18,FIND(\"-\",X18)+1,LEN(X18)-FIND(\"-\",X18)-1)-0))","v":""},{"$f":"IF(OR(ISERROR(FIND(\"-\",Y18)),AM18>'export html'!$AR$7),\"\",IF(RIGHT(Y18)<>\"*\",MID(Y18,FIND(\"-\",Y18)+1,LEN(Y18)-FIND(\"-\",Y18))-0,MID(Y18,FIND(\"-\",Y18)+1,LEN(Y18)-FIND(\"-\",Y18)-1)-0))","v":""},{"$f":"IF(OR(ISERROR(FIND(\"-\",Z18)),AN18>'export html'!$AR$7),\"\",IF(RIGHT(Z18)<>\"*\",MID(Z18,FIND(\"-\",Z18)+1,LEN(Z18)-FIND(\"-\",Z18))-0,MID(Z18,FIND(\"-\",Z18)+1,LEN(Z18)-FIND(\"-\",Z18)-1)-0))","v":""},{"$f":"IF(OR(ISERROR(FIND(\"-\",AA18)),AO18>'export html'!$AR$7),\"\",IF(RIGHT(AA18)<>\"*\",MID(AA18,FIND(\"-\",AA18)+1,LEN(AA18)-FIND(\"-\",AA18))-0,MID(AA18,FIND(\"-\",AA18)+1,LEN(AA18)-FIND(\"-\",AA18)-1)-0))","v":2},{"$f":"IF(OR(ISERROR(FIND(\"-\",AB18)),AP18>'export html'!$AR$7),\"\",IF(RIGHT(AB18)<>\"*\",MID(AB18,FIND(\"-\",AB18)+1,LEN(AB18)-FIND(\"-\",AB18))-0,MID(AB18,FIND(\"-\",AB18)+1,LEN(AB18)-FIND(\"-\",AB18)-1)-0))","v":""},{"$f":"IF(OR(ISERROR(FIND(\"-\",AC18)),AQ18>'export html'!$AR$7),\"\",IF(RIGHT(AC18)<>\"*\",MID(AC18,FIND(\"-\",AC18)+1,LEN(AC18)-FIND(\"-\",AC18))-0,MID(AC18,FIND(\"-\",AC18)+1,LEN(AC18)-FIND(\"-\",AC18)-1)-0))","v":1},null,14,{"$f":"IF(OR(ISERROR(FIND(\"-\",Q18)),AE18<='export html'!$AR$7),\"\",IF(RIGHT(Q18)<>\"*\",MID(Q18,FIND(\"-\",Q18)+1,LEN(Q18)-FIND(\"-\",Q18))-0,MID(Q18,FIND(\"-\",Q18)+1,LEN(Q18)-FIND(\"-\",Q18)-1)-0))","v":""},{"$f":"IF(OR(ISERROR(FIND(\"-\",R18)),AF18<='export html'!$AR$7),\"\",IF(RIGHT(R18)<>\"*\",MID(R18,FIND(\"-\",R18)+1,LEN(R18)-FIND(\"-\",R18))-0,MID(R18,FIND(\"-\",R18)+1,LEN(R18)-FIND(\"-\",R18)-1)-0))","v":""},{"$f":"IF(OR(ISERROR(FIND(\"-\",S18)),AG18<='export html'!$AR$7),\"\",IF(RIGHT(S18)<>\"*\",MID(S18,FIND(\"-\",S18)+1,LEN(S18)-FIND(\"-\",S18))-0,MID(S18,FIND(\"-\",S18)+1,LEN(S18)-FIND(\"-\",S18)-1)-0))","v":""},{"$f":"IF(OR(ISERROR(FIND(\"-\",T18)),AH18<='export html'!$AR$7),\"\",IF(RIGHT(T18)<>\"*\",MID(T18,FIND(\"-\",T18)+1,LEN(T18)-FIND(\"-\",T18))-0,MID(T18,FIND(\"-\",T18)+1,LEN(T18)-FIND(\"-\",T18)-1)-0))","v":""},{"$f":"IF(OR(ISERROR(FIND(\"-\",U18)),AI18<='export html'!$AR$7),\"\",IF(RIGHT(U18)<>\"*\",MID(U18,FIND(\"-\",U18)+1,LEN(U18)-FIND(\"-\",U18))-0,MID(U18,FIND(\"-\",U18)+1,LEN(U18)-FIND(\"-\",U18)-1)-0))","v":""},{"$f":"IF(OR(ISERROR(FIND(\"-\",V18)),AJ18<='export html'!$AR$7),\"\",IF(RIGHT(V18)<>\"*\",MID(V18,FIND(\"-\",V18)+1,LEN(V18)-FIND(\"-\",V18))-0,MID(V18,FIND(\"-\",V18)+1,LEN(V18)-FIND(\"-\",V18)-1)-0))","v":""},{"$f":"IF(OR(ISERROR(FIND(\"-\",W18)),AK18<='export html'!$AR$7),\"\",IF(RIGHT(W18)<>\"*\",MID(W18,FIND(\"-\",W18)+1,LEN(W18)-FIND(\"-\",W18))-0,MID(W18,FIND(\"-\",W18)+1,LEN(W18)-FIND(\"-\",W18)-1)-0))","v":""},{"$f":"IF(OR(ISERROR(FIND(\"-\",X18)),AL18<='export html'!$AR$7),\"\",IF(RIGHT(X18)<>\"*\",MID(X18,FIND(\"-\",X18)+1,LEN(X18)-FIND(\"-\",X18))-0,MID(X18,FIND(\"-\",X18)+1,LEN(X18)-FIND(\"-\",X18)-1)-0))","v":""},{"$f":"IF(OR(ISERROR(FIND(\"-\",Y18)),AM18<='export html'!$AR$7),\"\",IF(RIGHT(Y18)<>\"*\",MID(Y18,FIND(\"-\",Y18)+1,LEN(Y18)-FIND(\"-\",Y18))-0,MID(Y18,FIND(\"-\",Y18)+1,LEN(Y18)-FIND(\"-\",Y18)-1)-0))","v":""},{"$f":"IF(OR(ISERROR(FIND(\"-\",Z18)),AN18<='export html'!$AR$7),\"\",IF(RIGHT(Z18)<>\"*\",MID(Z18,FIND(\"-\",Z18)+1,LEN(Z18)-FIND(\"-\",Z18))-0,MID(Z18,FIND(\"-\",Z18)+1,LEN(Z18)-FIND(\"-\",Z18)-1)-0))","v":""},{"$f":"IF(OR(ISERROR(FIND(\"-\",AA18)),AO18<='export html'!$AR$7),\"\",IF(RIGHT(AA18)<>\"*\",MID(AA18,FIND(\"-\",AA18)+1,LEN(AA18)-FIND(\"-\",AA18))-0,MID(AA18,FIND(\"-\",AA18)+1,LEN(AA18)-FIND(\"-\",AA18)-1)-0))","v":""},{"$f":"IF(OR(ISERROR(FIND(\"-\",AB18)),AP18<='export html'!$AR$7),\"\",IF(RIGHT(AB18)<>\"*\",MID(AB18,FIND(\"-\",AB18)+1,LEN(AB18)-FIND(\"-\",AB18))-0,MID(AB18,FIND(\"-\",AB18)+1,LEN(AB18)-FIND(\"-\",AB18)-1)-0))","v":""},{"$f":"IF(OR(ISERROR(FIND(\"-\",AC18)),AQ18<='export html'!$AR$7),\"\",IF(RIGHT(AC18)<>\"*\",MID(AC18,FIND(\"-\",AC18)+1,LEN(AC18)-FIND(\"-\",AC18))-0,MID(AC18,FIND(\"-\",AC18)+1,LEN(AC18)-FIND(\"-\",AC18)-1)-0))","v":""},null,14]
[null,null,null,{"$f":"IF('export html'!A4=\"\",\"\",'export html'!A4)","v":"2024-10-06"},{"$f":"IF('export html'!B4=\"\",\"\",'export html'!B4)","v":6},{"$f":"IF('export html'!C4=\"\",\"\",'export html'!C4)","v":"Alberta Schilde - Antwerp Global"},null,null,null,null,null,null,null,{"$f":"IF('export html'!D4=\"\",\"\",'export html'!D4)","v":"2-0"},null,null,null,null,null,null,null,null,null,null,null,null,null,null,null,null,null,null,null,null,null,null,null,null,null,null,null,null,null,null,null,null,null,null,null,null,null,null,null,null,null,null,null,null,null,null,null,null,null,null,null,null,null,null,null,null,null,null,null,null,1,2,3,4,5,6,7,8,9,10,11,12,13,14,null,1,2,3,4,5,6,7,8,9,10,11,12,13,14]
[null,null,null,{"$f":"IF('export html'!A5=\"\",\"\",'export html'!A5)","v":"2024-10-06"},{"$f":"IF('export html'!B5=\"\",\"\",'export html'!B5)","v":6},{"$f":"IF('export html'!C5=\"\",\"\",'export html'!C5)","v":"Bar Patron - Jolika"},null,null,null,null,null,null,null,{"$f":"IF('export html'!D5=\"\",\"\",'export html'!D5)","v":"6-0"},null,null,null,null,null,null,null,null,null,null,null,null,null,null,null,null,null,null,null,null,null,null,null,null,null,null,null,null,null,null,null,null,null,null,null,null,null,null,null,null,null,null,null,null,null,null,null,null,null,null,null,null,null,null,null,null,null,null,null,1,null,{"$f":"IF(OR(ISERROR(FIND(\"-\",R5)),AF5>'export html'!$AR$7),\"\",IF(AND(LEFT(R5)=\"*\",RIGHT(R5)=\"*\"),\"ff\",IF(BX5>BX20,\"t\",IF(BX5<BX20,\"u\",\"g\"))))","v":"t"},{"$f":"IF(OR(ISERROR(FIND(\"-\",S5)),AG5>'export html'!$AR$7),\"\",IF(AND(LEFT(S5)=\"*\",RIGHT(S5)=\"*\"),\"ff\",IF(BY5>BY20,\"t\",IF(BY5<BY20,\"u\",\"g\"))))","v":""},{"$f":"IF(OR(ISERROR(FIND(\"-\",T5)),AH5>'export html'!$AR$7),\"\",IF(AND(LEFT(T5)=\"*\",RIGHT(T5)=\"*\"),\"ff\",IF(BZ5>BZ20,\"t\",IF(BZ5<BZ20,\"u\",\"g\"))))","v":""},{"$f":"IF(OR(ISERROR(FIND(\"-\",U5)),AI5>'export html'!$AR$7),\"\",IF(AND(LEFT(U5)=\"*\",RIGHT(U5)=\"*\"),\"ff\",IF(CA5>CA20,\"t\",IF(CA5<CA20,\"u\",\"g\"))))","v":""},{"$f":"IF(OR(ISERROR(FIND(\"-\",V5)),AJ5>'export html'!$AR$7),\"\",IF(AND(LEFT(V5)=\"*\",RIGHT(V5)=\"*\"),\"ff\",IF(CB5>CB20,\"t\",IF(CB5<CB20,\"u\",\"g\"))))","v":""},{"$f":"IF(OR(ISERROR(FIND(\"-\",W5)),AK5>'export html'!$AR$7),\"\",IF(AND(LEFT(W5)=\"*\",RIGHT(W5)=\"*\"),\"ff\",IF(CC5>CC20,\"t\",IF(CC5<CC20,\"u\",\"g\"))))","v":""},{"$f":"IF(OR(ISERROR(FIND(\"-\",X5)),AL5>'export html'!$AR$7),\"\",IF(AND(LEFT(X5)=\"*\",RIGHT(X5)=\"*\"),\"ff\",IF(CD5>CD20,\"t\",IF(CD5<CD20,\"u\",\"g\"))))","v":""},{"$f":"IF(OR(ISERROR(FIND(\"-\",Y5)),AM5>'export html'!$AR$7),\"\",IF(AND(LEFT(Y5)=\"*\",RIGHT(Y5)=\"*\"),\"ff\",IF(CE5>CE20,\"t\",IF(CE5<CE20,\"u\",\"g\"))))","v":""},{"$f":"IF(OR(ISERROR(FIND(\"-\",Z5)),AN5>'export html'!$AR$7),\"\",IF(AND(LEFT(Z5)=\"*\",RIGHT(Z5)=\"*\"),\"ff\",IF(CF5>CF20,\"t\",IF(CF5<CF20,\"u\",\"g\"))))","v":""},{"$f":"IF(OR(ISERROR(FIND(\"-\",AA5)),AO5>'export html'!$AR$7),\"\",IF(AND(LEFT(AA5)=\"*\",RIGHT(AA5)=\"*\"),\"ff\",IF(CG5>CG20,\"t\",IF(CG5<CG20,\"u\",\"g\"))))","v":""},{"$f":"IF(OR(ISERROR(FIND(\"-\",AB5)),AP5>'export html'!$AR$7),\"\",IF(AND(LEFT(AB5)=\"*\",RIGHT(AB5)=\"*\"),\"ff\",IF(CH5>CH20,\"t\",IF(CH5<CH20,\"u\",\"g\"))))","v":"t"},{"$f":"IF(OR(ISERROR(FIND(\"-\",AC5)),AQ5>'export html'!$AR$7),\"\",IF(AND(LEFT(AC5)=\"*\",RIGHT(AC5)=\"*\"),\"ff\",IF(CI5>CI20,\"t\",IF(CI5<CI20,\"u\",\"g\"))))","v":""},{"$f":"IF(OR(ISERROR(FIND(\"-\",AD5)),AR5>'export html'!$AR$7),\"\",IF(AND(LEFT(AD5)=\"*\",RIGHT(AD5)=\"*\"),\"ff\",IF(CJ5>CJ20,\"t\",IF(CJ5<CJ20,\"u\",\"g\"))))","v":"g"},1,null,{"$f":"IF(OR(ISERROR(FIND(\"-\",R5)),AF5<='export html'!$AR$7),\"\",IF(AND(LEFT(R5)=\"*\",RIGHT(R5)=\"*\"),\"ff\",IF(CM5>CM20,\"t\",IF(CM5<CM20,\"u\",\"g\"))))","v":""},{"$f":"IF(OR(ISERROR(FIND(\"-\",S5)),AG5<='export html'!$AR$7),\"\",IF(AND(LEFT(S5)=\"*\",RIGHT(S5)=\"*\"),\"ff\",IF(CN5>CN20,\"t\",IF(CN5<CN20,\"u\",\"g\"))))","v":""},{"$f":"IF(OR(ISERROR(FIND(\"-\",T5)),AH5<='export html'!$AR$7),\"\",IF(AND(LEFT(T5)=\"*\",RIGHT(T5)=\"*\"),\"ff\",IF(CO5>CO20,\"t\",IF(CO5<CO20,\"u\",\"g\"))))","v":""},{"$f":"IF(OR(ISERROR(FIND(\"-\",U5)),AI5<='export html'!$AR$7),\"\",IF(AND(LEFT(U5)=\"*\",RIGHT(U5)=\"*\"),\"ff\",IF(CP5>CP20,\"t\",IF(CP5<CP20,\"u\",\"g\"))))","v":""},{"$f":"IF(OR(ISERROR(FIND(\"-\",V5)),AJ5<='export html'!$AR$7),\"\",IF(AND(LEFT(V5)=\"*\",RIGHT(V5)=\"*\"),\"ff\",IF(CQ5>CQ20,\"t\",IF(CQ5<CQ20,\"u\",\"g\"))))","v":""},{"$f":"IF(OR(ISERROR(FIND(\"-\",W5)),AK5<='export html'!$AR$7),\"\",IF(AND(LEFT(W5)=\"*\",RIGHT(W5)=\"*\"),\"ff\",IF(CR5>CR20,\"t\",IF(CR5<CR20,\"u\",\"g\"))))","v":""},{"$f":"IF(OR(ISERROR(FIND(\"-\",X5)),AL5<='export html'!$AR$7),\"\",IF(AND(LEFT(X5)=\"*\",RIGHT(X5)=\"*\"),\"ff\",IF(CS5>CS20,\"t\",IF(CS5<CS20,\"u\",\"g\"))))","v":""},{"$f":"IF(OR(ISERROR(FIND(\"-\",Y5)),AM5<='export html'!$AR$7),\"\",IF(AND(LEFT(Y5)=\"*\",RIGHT(Y5)=\"*\"),\"ff\",IF(CT5>CT20,\"t\",IF(CT5<CT20,\"u\",\"g\"))))","v":""},{"$f":"IF(OR(ISERROR(FIND(\"-\",Z5)),AN5<='export html'!$AR$7),\"\",IF(AND(LEFT(Z5)=\"*\",RIGHT(Z5)=\"*\"),\"ff\",IF(CU5>CU20,\"t\",IF(CU5<CU20,\"u\",\"g\"))))","v":""},{"$f":"IF(OR(ISERROR(FIND(\"-\",AA5)),AO5<='export html'!$AR$7),\"\",IF(AND(LEFT(AA5)=\"*\",RIGHT(AA5)=\"*\"),\"ff\",IF(CV5>CV20,\"t\",IF(CV5<CV20,\"u\",\"g\"))))","v":""},{"$f":"IF(OR(ISERROR(FIND(\"-\",AB5)),AP5<='export html'!$AR$7),\"\",IF(AND(LEFT(AB5)=\"*\",RIGHT(AB5)=\"*\"),\"ff\",IF(CW5>CW20,\"t\",IF(CW5<CW20,\"u\",\"g\"))))","v":""},{"$f":"IF(OR(ISERROR(FIND(\"-\",AC5)),AQ5<='export html'!$AR$7),\"\",IF(AND(LEFT(AC5)=\"*\",RIGHT(AC5)=\"*\"),\"ff\",IF(CX5>CX20,\"t\",IF(CX5<CX20,\"u\",\"g\"))))","v":""},{"$f":"IF(OR(ISERROR(FIND(\"-\",AD5)),AR5<='export html'!$AR$7),\"\",IF(AND(LEFT(AD5)=\"*\",RIGHT(AD5)=\"*\"),\"ff\",IF(CY5>CY20,\"t\",IF(CY5<CY20,\"u\",\"g\"))))","v":""},1]
[null,null,null,{"$f":"IF('export html'!A6=\"\",\"\",'export html'!A6)","v":"2024-10-06"},{"$f":"IF('export html'!B6=\"\",\"\",'export html'!B6)","v":6},{"$f":"IF('export html'!C6=\"\",\"\",'export html'!C6)","v":"Corum - Sint Anneke"},null,null,null,null,null,null,null,{"$f":"IF('export html'!D6=\"\",\"\",'export html'!D6)","v":"2-10"},null,null,null,null,null,null,null,null,null,null,null,null,null,null,null,null,null,null,null,null,null,null,null,null,null,null,null,null,null,null,null,null,null,null,null,null,null,null,null,null,null,null,null,null,null,null,null,null,null,null,null,null,null,null,null,null,null,null,null,2,{"$f":"IF(OR(ISERROR(FIND(\"-\",Q6)),AE6>'export html'!$AR$7),\"\",IF(AND(LEFT(Q6)=\"*\",RIGHT(Q6)=\"*\"),\"ff\",IF(BW6>BW21,\"t\",IF(BW6<BW21,\"u\",\"g\"))))","v":""},null,{"$f":"IF(OR(ISERROR(FIND(\"-\",S6)),AG6>'export html'!$AR$7),\"\",IF(AND(LEFT(S6)=\"*\",RIGHT(S6)=\"*\"),\"ff\",IF(BY6>BY21,\"t\",IF(BY6<BY21,\"u\",\"g\"))))","v":""},{"$f":"IF(OR(ISERROR(FIND(\"-\",T6)),AH6>'export html'!$AR$7),\"\",IF(AND(LEFT(T6)=\"*\",RIGHT(T6)=\"*\"),\"ff\",IF(BZ6>BZ21,\"t\",IF(BZ6<BZ21,\"u\",\"g\"))))","v":""},{"$f":"IF(OR(ISERROR(FIND(\"-\",U6)),AI6>'export html'!$AR$7),\"\",IF(AND(LEFT(U6)=\"*\",RIGHT(U6)=\"*\"),\"ff\",IF(CA6>CA21,\"t\",IF(CA6<CA21,\"u\",\"g\"))))","v":""},{"$f":"IF(OR(ISERROR(FIND(\"-\",V6)),AJ6>'export html'!$AR$7),\"\",IF(AND(LEFT(V6)=\"*\",RIGHT(V6)=\"*\"),\"ff\",IF(CB6>CB21,\"t\",IF(CB6<CB21,\"u\",\"g\"))))","v":""},{"$f":"IF(OR(ISERROR(FIND(\"-\",W6)),AK6>'export html'!$AR$7),\"\",IF(AND(LEFT(W6)=\"*\",RIGHT(W6)=\"*\"),\"ff\",IF(CC6>CC21,\"t\",IF(CC6<CC21,\"u\",\"g\"))))","v":"t"},{"$f":"IF(OR(ISERROR(FIND(\"-\",X6)),AL6>'export html'!$AR$7),\"\",IF(AND(LEFT(X6)=\"*\",RIGHT(X6)=\"*\"),\"ff\",IF(CD6>CD21,\"t\",IF(CD6<CD21,\"u\",\"g\"))))","v":""},{"$f":"IF(OR(ISERROR(FIND(\"-\",Y6)),AM6>'export html'!$AR$7),\"\",IF(AND(LEFT(Y6)=\"*\",RIGHT(Y6)=\"*\"),\"ff\",IF(CE6>CE21,\"t\",IF(CE6<CE21,\"u\",\"g\"))))","v":"t"},{"$f":"IF(OR(ISERROR(FIND(\"-\",Z6)),AN6>'export html'!$AR$7),\"\",IF(AND(LEFT(Z6)=\"*\",RIGHT(Z6)=\"*\"),\"ff\",IF(CF6>CF21,\"t\",IF(CF6<CF21,\"u\",\"g\"))))","v":""},{"$f":"IF(OR(ISERROR(FIND(\"-\",AA6)),AO6>'export html'!$AR$7),\"\",IF(AND(LEFT(AA6)=\"*\",RIGHT(AA6)=\"*\"),\"ff\",IF(CG6>CG21,\"t\",IF(CG6<CG21,\"u\",\"g\"))))","v":"t"},{"$f":"IF(OR(ISERROR(FIND(\"-\",AB6)),AP6>'export html'!$AR$7),\"\",IF(AND(LEFT(AB6)=\"*\",RIGHT(AB6)=\"*\"),\"ff\",IF(CH6>CH21,\"t\",IF(CH6<CH21,\"u\",\"g\"))))","v":""},{"$f":"IF(OR(ISERROR(FIND(\"-\",AC6)),AQ6>'export html'!$AR$7),\"\",IF(AND(LEFT(AC6)=\"*\",RIGHT(AC6)=\"*\"),\"ff\",IF(CI6>CI21,\"t\",IF(CI6<CI21,\"u\",\"g\"))))","v":""},{"$f":"IF(OR(ISERROR(FIND(\"-\",AD6)),AR6>'export html'!$AR$7),\"\",IF(AND(LEFT(AD6)=\"*\",RIGHT(AD6)=\"*\"),\"ff\",IF(CJ6>CJ21,\"t\",IF(CJ6<CJ21,\"u\",\"g\"))))","v":""},2,{"$f":"IF(OR(ISERROR(FIND(\"-\",Q6)),AE6<='export html'!$AR$7),\"\",IF(AND(LEFT(Q6)=\"*\",RIGHT(Q6)=\"*\"),\"ff\",IF(CL6>CL21,\"t\",IF(CL6<CL21,\"u\",\"g\"))))","v":""},null,{"$f":"IF(OR(ISERROR(FIND(\"-\",S6)),AG6<='export html'!$AR$7),\"\",IF(AND(LEFT(S6)=\"*\",RIGHT(S6)=\"*\"),\"ff\",IF(CN6>CN21,\"t\",IF(CN6<CN21,\"u\",\"g\"))))","v":""},{"$f":"IF(OR(ISERROR(FIND(\"-\",T6)),AH6<='export html'!$AR$7),\"\",IF(AND(LEFT(T6)=\"*\",RIGHT(T6)=\"*\"),\"ff\",IF(CO6>CO21,\"t\",IF(CO6<CO21,\"u\",\"g\"))))","v":""},{"$f":"IF(OR(ISERROR(FIND(\"-\",U6)),AI6<='export html'!$AR$7),\"\",IF(AND(LEFT(U6)=\"*\",RIGHT(U6)=\"*\"),\"ff\",IF(CP6>CP21,\"t\",IF(CP6<CP21,\"u\",\"g\"))))","v":""},{"$f":"IF(OR(ISERROR(FIND(\"-\",V6)),AJ6<='export html'!$AR$7),\"\",IF(AND(LEFT(V6)=\"*\",RIGHT(V6)=\"*\"),\"ff\",IF(CQ6>CQ21,\"t\",IF(CQ6<CQ21,\"u\",\"g\"))))","v":""},{"$f":"IF(OR(ISERROR(FIND(\"-\",W6)),AK6<='export html'!$AR$7),\"\",IF(AND(LEFT(W6)=\"*\",RIGHT(W6)=\"*\"),\"ff\",IF(CR6>CR21,\"t\",IF(CR6<CR21,\"u\",\"g\"))))","v":""},{"$f":"IF(OR(ISERROR(FIND(\"-\",X6)),AL6<='export html'!$AR$7),\"\",IF(AND(LEFT(X6)=\"*\",RIGHT(X6)=\"*\"),\"ff\",IF(CS6>CS21,\"t\",IF(CS6<CS21,\"u\",\"g\"))))","v":""},{"$f":"IF(OR(ISERROR(FIND(\"-\",Y6)),AM6<='export html'!$AR$7),\"\",IF(AND(LEFT(Y6)=\"*\",RIGHT(Y6)=\"*\"),\"ff\",IF(CT6>CT21,\"t\",IF(CT6<CT21,\"u\",\"g\"))))","v":""},{"$f":"IF(OR(ISERROR(FIND(\"-\",Z6)),AN6<='export html'!$AR$7),\"\",IF(AND(LEFT(Z6)=\"*\",RIGHT(Z6)=\"*\"),\"ff\",IF(CU6>CU21,\"t\",IF(CU6<CU21,\"u\",\"g\"))))","v":""},{"$f":"IF(OR(ISERROR(FIND(\"-\",AA6)),AO6<='export html'!$AR$7),\"\",IF(AND(LEFT(AA6)=\"*\",RIGHT(AA6)=\"*\"),\"ff\",IF(CV6>CV21,\"t\",IF(CV6<CV21,\"u\",\"g\"))))","v":""},{"$f":"IF(OR(ISERROR(FIND(\"-\",AB6)),AP6<='export html'!$AR$7),\"\",IF(AND(LEFT(AB6)=\"*\",RIGHT(AB6)=\"*\"),\"ff\",IF(CW6>CW21,\"t\",IF(CW6<CW21,\"u\",\"g\"))))","v":""},{"$f":"IF(OR(ISERROR(FIND(\"-\",AC6)),AQ6<='export html'!$AR$7),\"\",IF(AND(LEFT(AC6)=\"*\",RIGHT(AC6)=\"*\"),\"ff\",IF(CX6>CX21,\"t\",IF(CX6<CX21,\"u\",\"g\"))))","v":""},{"$f":"IF(OR(ISERROR(FIND(\"-\",AD6)),AR6<='export html'!$AR$7),\"\",IF(AND(LEFT(AD6)=\"*\",RIGHT(AD6)=\"*\"),\"ff\",IF(CY6>CY21,\"t\",IF(CY6<CY21,\"u\",\"g\"))))","v":""},2]
[null,null,null,{"$f":"IF('export html'!A7=\"\",\"\",'export html'!A7)","v":"2024-10-06"},{"$f":"IF('export html'!B7=\"\",\"\",'export html'!B7)","v":6},{"$f":"IF('export html'!C7=\"\",\"\",'export html'!C7)","v":"Daltons - Lucyvo"},null,null,null,null,null,null,null,{"$f":"IF('export html'!D7=\"\",\"\",'export html'!D7)","v":"3-0"},null,null,null,null,null,null,null,null,null,null,null,null,null,null,null,null,null,null,null,null,null,null,null,null,null,null,null,null,null,null,null,null,null,null,null,null,null,null,null,null,null,null,null,null,null,null,null,null,null,null,null,null,null,null,null,null,null,null,null,3,{"$f":"IF(OR(ISERROR(FIND(\"-\",Q7)),AE7>'export html'!$AR$7),\"\",IF(AND(LEFT(Q7)=\"*\",RIGHT(Q7)=\"*\"),\"ff\",IF(BW7>BW22,\"t\",IF(BW7<BW22,\"u\",\"g\"))))","v":""},{"$f":"IF(OR(ISERROR(FIND(\"-\",R7)),AF7>'export html'!$AR$7),\"\",IF(AND(LEFT(R7)=\"*\",RIGHT(R7)=\"*\"),\"ff\",IF(BX7>BX22,\"t\",IF(BX7<BX22,\"u\",\"g\"))))","v":"t"},null,{"$f":"IF(OR(ISERROR(FIND(\"-\",T7)),AH7>'export html'!$AR$7),\"\",IF(AND(LEFT(T7)=\"*\",RIGHT(T7)=\"*\"),\"ff\",IF(BZ7>BZ22,\"t\",IF(BZ7<BZ22,\"u\",\"g\"))))","v":""},{"$f":"IF(OR(ISERROR(FIND(\"-\",U7)),AI7>'export html'!$AR$7),\"\",IF(AND(LEFT(U7)=\"*\",RIGHT(U7)=\"*\"),\"ff\",IF(CA7>CA22,\"t\",IF(CA7<CA22,\"u\",\"g\"))))","v":""},{"$f":"IF(OR(ISERROR(FIND(\"-\",V7)),AJ7>'export html'!$AR$7),\"\",IF(AND(LEFT(V7)=\"*\",RIGHT(V7)=\"*\"),\"ff\",IF(CB7>CB22,\"t\",IF(CB7<CB22,\"u\",\"g\"))))","v":""},{"$f":"IF(OR(ISERROR(FIND(\"-\",W7)),AK7>'export html'!$AR$7),\"\",IF(AND(LEFT(W7)=\"*\",RIGHT(W7)=\"*\"),\"ff\",IF(CC7>CC22,\"t\",IF(CC7<CC22,\"u\",\"g\"))))","v":""},{"$f":"IF(OR(ISERROR(FIND(\"-\",X7)),AL7>'export html'!$AR$7),\"\",IF(AND(LEFT(X7)=\"*\",RIGHT(X7)=\"*\"),\"ff\",IF(CD7>CD22,\"t\",IF(CD7<CD22,\"u\",\"g\"))))","v":""},{"$f":"IF(OR(ISERROR(FIND(\"-\",Y7)),AM7>'export html'!$AR$7),\"\",IF(AND(LEFT(Y7)=\"*\",RIGHT(Y7)=\"*\"),\"ff\",IF(CE7>CE22,\"t\",IF(CE7<CE22,\"u\",\"g\"))))","v":"t"},{"$f":"IF(OR(ISERROR(FIND(\"-\",Z7)),AN7>'export html'!$AR$7),\"\",IF(AND(LEFT(Z7)=\"*\",RIGHT(Z7)=\"*\"),\"ff\",IF(CF7>CF22,\"t\",IF(CF7<CF22,\"u\",\"g\"))))","v":""},{"$f":"IF(OR(ISERROR(FIND(\"-\",AA7)),AO7>'export html'!$AR$7),\"\",IF(AND(LEFT(AA7)=\"*\",RIGHT(AA7)=\"*\"),\"ff\",IF(CG7>CG22,\"t\",IF(CG7<CG22,\"u\",\"g\"))))","v":""},{"$f":"IF(OR(ISERROR(FIND(\"-\",AB7)),AP7>'export html'!$AR$7),\"\",IF(AND(LEFT(AB7)=\"*\",RIGHT(AB7)=\"*\"),\"ff\",IF(CH7>CH22,\"t\",IF(CH7<CH22,\"u\",\"g\"))))","v":""},{"$f":"IF(OR(ISERROR(FIND(\"-\",AC7)),AQ7>'export html'!$AR$7),\"\",IF(AND(LEFT(AC7)=\"*\",RIGHT(AC7)=\"*\"),\"ff\",IF(CI7>CI22,\"t\",IF(CI7<CI22,\"u\",\"g\"))))","v":""},{"$f":"IF(OR(ISERROR(FIND(\"-\",AD7)),AR7>'export html'!$AR$7),\"\",IF(AND(LEFT(AD7)=\"*\",RIGHT(AD7)=\"*\"),\"ff\",IF(CJ7>CJ22,\"t\",IF(CJ7<CJ22,\"u\",\"g\"))))","v":"g"},3,{"$f":"IF(OR(ISERROR(FIND(\"-\",Q7)),AE7<='export html'!$AR$7),\"\",IF(AND(LEFT(Q7)=\"*\",RIGHT(Q7)=\"*\"),\"ff\",IF(CL7>CL22,\"t\",IF(CL7<CL22,\"u\",\"g\"))))","v":""},{"$f":"IF(OR(ISERROR(FIND(\"-\",R7)),AF7<='export html'!$AR$7),\"\",IF(AND(LEFT(R7)=\"*\",RIGHT(R7)=\"*\"),\"ff\",IF(CM7>CM22,\"t\",IF(CM7<CM22,\"u\",\"g\"))))","v":""},null,{"$f":"IF(OR(ISERROR(FIND(\"-\",T7)),AH7<='export html'!$AR$7),\"\",IF(AND(LEFT(T7)=\"*\",RIGHT(T7)=\"*\"),\"ff\",IF(CO7>CO22,\"t\",IF(CO7<CO22,\"u\",\"g\"))))","v":""},{"$f":"IF(OR(ISERROR(FIND(\"-\",U7)),AI7<='export html'!$AR$7),\"\",IF(AND(LEFT(U7)=\"*\",RIGHT(U7)=\"*\"),\"ff\",IF(CP7>CP22,\"t\",IF(CP7<CP22,\"u\",\"g\"))))","v":""},{"$f":"IF(OR(ISERROR(FIND(\"-\",V7)),AJ7<='export html'!$AR$7),\"\",IF(AND(LEFT(V7)=\"*\",RIGHT(V7)=\"*\"),\"ff\",IF(CQ7>CQ22,\"t\",IF(CQ7<CQ22,\"u\",\"g\"))))","v":""},{"$f":"IF(OR(ISERROR(FIND(\"-\",W7)),AK7<='export html'!$AR$7),\"\",IF(AND(LEFT(W7)=\"*\",RIGHT(W7)=\"*\"),\"ff\",IF(CR7>CR22,\"t\",IF(CR7<CR22,\"u\",\"g\"))))","v":""},{"$f":"IF(OR(ISERROR(FIND(\"-\",X7)),AL7<='export html'!$AR$7),\"\",IF(AND(LEFT(X7)=\"*\",RIGHT(X7)=\"*\"),\"ff\",IF(CS7>CS22,\"t\",IF(CS7<CS22,\"u\",\"g\"))))","v":""},{"$f":"IF(OR(ISERROR(FIND(\"-\",Y7)),AM7<='export html'!$AR$7),\"\",IF(AND(LEFT(Y7)=\"*\",RIGHT(Y7)=\"*\"),\"ff\",IF(CT7>CT22,\"t\",IF(CT7<CT22,\"u\",\"g\"))))","v":""},{"$f":"IF(OR(ISERROR(FIND(\"-\",Z7)),AN7<='export html'!$AR$7),\"\",IF(AND(LEFT(Z7)=\"*\",RIGHT(Z7)=\"*\"),\"ff\",IF(CU7>CU22,\"t\",IF(CU7<CU22,\"u\",\"g\"))))","v":""},{"$f":"IF(OR(ISERROR(FIND(\"-\",AA7)),AO7<='export html'!$AR$7),\"\",IF(AND(LEFT(AA7)=\"*\",RIGHT(AA7)=\"*\"),\"ff\",IF(CV7>CV22,\"t\",IF(CV7<CV22,\"u\",\"g\"))))","v":""},{"$f":"IF(OR(ISERROR(FIND(\"-\",AB7)),AP7<='export html'!$AR$7),\"\",IF(AND(LEFT(AB7)=\"*\",RIGHT(AB7)=\"*\"),\"ff\",IF(CW7>CW22,\"t\",IF(CW7<CW22,\"u\",\"g\"))))","v":""},{"$f":"IF(OR(ISERROR(FIND(\"-\",AC7)),AQ7<='export html'!$AR$7),\"\",IF(AND(LEFT(AC7)=\"*\",RIGHT(AC7)=\"*\"),\"ff\",IF(CX7>CX22,\"t\",IF(CX7<CX22,\"u\",\"g\"))))","v":""},{"$f":"IF(OR(ISERROR(FIND(\"-\",AD7)),AR7<='export html'!$AR$7),\"\",IF(AND(LEFT(AD7)=\"*\",RIGHT(AD7)=\"*\"),\"ff\",IF(CY7>CY22,\"t\",IF(CY7<CY22,\"u\",\"g\"))))","v":""},3]
[null,null,null,{"$f":"IF('export html'!A8=\"\",\"\",'export html'!A8)","v":"2024-10-06"},{"$f":"IF('export html'!B8=\"\",\"\",'export html'!B8)","v":6},{"$f":"IF('export html'!C8=\"\",\"\",'export html'!C8)","v":"Hombeek - Yerevan United"},null,null,null,null,null,null,null,{"$f":"IF('export html'!D8=\"\",\"\",'export html'!D8)","v":"1-1"},null,null,null,null,null,null,null,null,null,null,null,null,null,null,null,null,null,null,null,null,null,null,null,null,null,null,null,null,null,null,null,null,null,null,null,null,null,null,null,null,null,null,null,null,null,null,null,null,null,null,null,null,null,null,null,null,null,null,null,4,{"$f":"IF(OR(ISERROR(FIND(\"-\",Q8)),AE8>'export html'!$AR$7),\"\",IF(AND(LEFT(Q8)=\"*\",RIGHT(Q8)=\"*\"),\"ff\",IF(BW8>BW23,\"t\",IF(BW8<BW23,\"u\",\"g\"))))","v":"t"},{"$f":"IF(OR(ISERROR(FIND(\"-\",R8)),AF8>'export html'!$AR$7),\"\",IF(AND(LEFT(R8)=\"*\",RIGHT(R8)=\"*\"),\"ff\",IF(BX8>BX23,\"t\",IF(BX8<BX23,\"u\",\"g\"))))","v":"u"},{"$f":"IF(OR(ISERROR(FIND(\"-\",S8)),AG8>'export html'!$AR$7),\"\",IF(AND(LEFT(S8)=\"*\",RIGHT(S8)=\"*\"),\"ff\",IF(BY8>BY23,\"t\",IF(BY8<BY23,\"u\",\"g\"))))","v":"u"},null,{"$f":"IF(OR(ISERROR(FIND(\"-\",U8)),AI8>'export html'!$AR$7),\"\",IF(AND(LEFT(U8)=\"*\",RIGHT(U8)=\"*\"),\"ff\",IF(CA8>CA23,\"t\",IF(CA8<CA23,\"u\",\"g\"))))","v":""},{"$f":"IF(OR(ISERROR(FIND(\"-\",V8)),AJ8>'export html'!$AR$7),\"\",IF(AND(LEFT(V8)=\"*\",RIGHT(V8)=\"*\"),\"ff\",IF(CB8>CB23,\"t\",IF(CB8<CB23,\"u\",\"g\"))))","v":""},{"$f":"IF(OR(ISERROR(FIND(\"-\",W8)),AK8>'export html'!$AR$7),\"\",IF(AND(LEFT(W8)=\"*\",RIGHT(W8)=\"*\"),\"ff\",IF(CC8>CC23,\"t\",IF(CC8<CC23,\"u\",\"g\"))))","v":""},{"$f":"IF(OR(ISERROR(FIND(\"-\",X8)),AL8>'export html'!$AR$7),\"\",IF(AND(LEFT(X8)=\"*\",RIGHT(X8)=\"*\"),\"ff\",IF(CD8>CD23,\"t\",IF(CD8<CD23,\"u\",\"g\"))))","v":""},{"$f":"IF(OR(ISERROR(FIND(\"-\",Y8)),AM8>'export html'!$AR$7),\"\",IF(AND(LEFT(Y8)=\"*\",RIGHT(Y8)=\"*\"),\"ff\",IF(CE8>CE23,\"t\",IF(CE8<CE23,\"u\",\"g\"))))","v":""},{"$f":"IF(OR(ISERROR(FIND(\"-\",Z8)),AN8>'export html'!$AR$7),\"\",IF(AND(LEFT(Z8)=\"*\",RIGHT(Z8)=\"*\"),\"ff\",IF(CF8>CF23,\"t\",IF(CF8<CF23,\"u\",\"g\"))))","v":""},{"$f":"IF(OR(ISERROR(FIND(\"-\",AA8)),AO8>'export html'!$AR$7),\"\",IF(AND(LEFT(AA8)=\"*\",RIGHT(AA8)=\"*\"),\"ff\",IF(CG8>CG23,\"t\",IF(CG8<CG23,\"u\",\"g\"))))","v":""},{"$f":"IF(OR(ISERROR(FIND(\"-\",AB8)),AP8>'export html'!$AR$7),\"\",IF(AND(LEFT(AB8)=\"*\",RIGHT(AB8)=\"*\"),\"ff\",IF(CH8>CH23,\"t\",IF(CH8<CH23,\"u\",\"g\"))))","v":""},{"$f":"IF(OR(ISERROR(FIND(\"-\",AC8)),AQ8>'export html'!$AR$7),\"\",IF(AND(LEFT(AC8)=\"*\",RIGHT(AC8)=\"*\"),\"ff\",IF(CI8>CI23,\"t\",IF(CI8<CI23,\"u\",\"g\"))))","v":""},{"$f":"IF(OR(ISERROR(FIND(\"-\",AD8)),AR8>'export html'!$AR$7),\"\",IF(AND(LEFT(AD8)=\"*\",RIGHT(AD8)=\"*\"),\"ff\",IF(CJ8>CJ23,\"t\",IF(CJ8<CJ23,\"u\",\"g\"))))","v":""},4,{"$f":"IF(OR(ISERROR(FIND(\"-\",Q8)),AE8<='export html'!$AR$7),\"\",IF(AND(LEFT(Q8)=\"*\",RIGHT(Q8)=\"*\"),\"ff\",IF(CL8>CL23,\"t\",IF(CL8<CL23,\"u\",\"g\"))))","v":""},{"$f":"IF(OR(ISERROR(FIND(\"-\",R8)),AF8<='export html'!$AR$7),\"\",IF(AND(LEFT(R8)=\"*\",RIGHT(R8)=\"*\"),\"ff\",IF(CM8>CM23,\"t\",IF(CM8<CM23,\"u\",\"g\"))))","v":""},{"$f":"IF(OR(ISERROR(FIND(\"-\",S8)),AG8<='export html'!$AR$7),\"\",IF(AND(LEFT(S8)=\"*\",RIGHT(S8)=\"*\"),\"ff\",IF(CN8>CN23,\"t\",IF(CN8<CN23,\"u\",\"g\"))))","v":""},null,{"$f":"IF(OR(ISERROR(FIND(\"-\",U8)),AI8<='export html'!$AR$7),\"\",IF(AND(LEFT(U8)=\"*\",RIGHT(U8)=\"*\"),\"ff\",IF(CP8>CP23,\"t\",IF(CP8<CP23,\"u\",\"g\"))))","v":""},{"$f":"IF(OR(ISERROR(FIND(\"-\",V8)),AJ8<='export html'!$AR$7),\"\",IF(AND(LEFT(V8)=\"*\",RIGHT(V8)=\"*\"),\"ff\",IF(CQ8>CQ23,\"t\",IF(CQ8<CQ23,\"u\",\"g\"))))","v":""},{"$f":"IF(OR(ISERROR(FIND(\"-\",W8)),AK8<='export html'!$AR$7),\"\",IF(AND(LEFT(W8)=\"*\",RIGHT(W8)=\"*\"),\"ff\",IF(CR8>CR23,\"t\",IF(CR8<CR23,\"u\",\"g\"))))","v":""},{"$f":"IF(OR(ISERROR(FIND(\"-\",X8)),AL8<='export html'!$AR$7),\"\",IF(AND(LEFT(X8)=\"*\",RIGHT(X8)=\"*\"),\"ff\",IF(CS8>CS23,\"t\",IF(CS8<CS23,\"u\",\"g\"))))","v":""},{"$f":"IF(OR(ISERROR(FIND(\"-\",Y8)),AM8<='export html'!$AR$7),\"\",IF(AND(LEFT(Y8)=\"*\",RIGHT(Y8)=\"*\"),\"ff\",IF(CT8>CT23,\"t\",IF(CT8<CT23,\"u\",\"g\"))))","v":""},{"$f":"IF(OR(ISERROR(FIND(\"-\",Z8)),AN8<='export html'!$AR$7),\"\",IF(AND(LEFT(Z8)=\"*\",RIGHT(Z8)=\"*\"),\"ff\",IF(CU8>CU23,\"t\",IF(CU8<CU23,\"u\",\"g\"))))","v":""},{"$f":"IF(OR(ISERROR(FIND(\"-\",AA8)),AO8<='export html'!$AR$7),\"\",IF(AND(LEFT(AA8)=\"*\",RIGHT(AA8)=\"*\"),\"ff\",IF(CV8>CV23,\"t\",IF(CV8<CV23,\"u\",\"g\"))))","v":""},{"$f":"IF(OR(ISERROR(FIND(\"-\",AB8)),AP8<='export html'!$AR$7),\"\",IF(AND(LEFT(AB8)=\"*\",RIGHT(AB8)=\"*\"),\"ff\",IF(CW8>CW23,\"t\",IF(CW8<CW23,\"u\",\"g\"))))","v":""},{"$f":"IF(OR(ISERROR(FIND(\"-\",AC8)),AQ8<='export html'!$AR$7),\"\",IF(AND(LEFT(AC8)=\"*\",RIGHT(AC8)=\"*\"),\"ff\",IF(CX8>CX23,\"t\",IF(CX8<CX23,\"u\",\"g\"))))","v":""},{"$f":"IF(OR(ISERROR(FIND(\"-\",AD8)),AR8<='export html'!$AR$7),\"\",IF(AND(LEFT(AD8)=\"*\",RIGHT(AD8)=\"*\"),\"ff\",IF(CY8>CY23,\"t\",IF(CY8<CY23,\"u\",\"g\"))))","v":""},4]
[null,null,null,{"$f":"IF('export html'!A9=\"\",\"\",'export html'!A9)","v":"2024-10-06"},{"$f":"IF('export html'!B9=\"\",\"\",'export html'!B9)","v":6},{"$f":"IF('export html'!C9=\"\",\"\",'export html'!C9)","v":"Goka - Racing Emblem"},null,null,null,null,null,null,null,{"$f":"IF('export html'!D9=\"\",\"\",'export html'!D9)","v":"2-5"},null,null,null,null,null,null,null,null,null,null,null,null,null,null,null,null,null,null,null,null,null,null,null,null,null,null,null,null,null,null,null,null,null,null,null,null,null,null,null,null,null,null,null,null,null,null,null,null,null,null,null,null,null,null,null,null,null,null,null,5,{"$f":"IF(OR(ISERROR(FIND(\"-\",Q9)),AE9>'export html'!$AR$7),\"\",IF(AND(LEFT(Q9)=\"*\",RIGHT(Q9)=\"*\"),\"ff\",IF(BW9>BW24,\"t\",IF(BW9<BW24,\"u\",\"g\"))))","v":"u"},{"$f":"IF(OR(ISERROR(FIND(\"-\",R9)),AF9>'export html'!$AR$7),\"\",IF(AND(LEFT(R9)=\"*\",RIGHT(R9)=\"*\"),\"ff\",IF(BX9>BX24,\"t\",IF(BX9<BX24,\"u\",\"g\"))))","v":""},{"$f":"IF(OR(ISERROR(FIND(\"-\",S9)),AG9>'export html'!$AR$7),\"\",IF(AND(LEFT(S9)=\"*\",RIGHT(S9)=\"*\"),\"ff\",IF(BY9>BY24,\"t\",IF(BY9<BY24,\"u\",\"g\"))))","v":""},{"$f":"IF(OR(ISERROR(FIND(\"-\",T9)),AH9>'export html'!$AR$7),\"\",IF(AND(LEFT(T9)=\"*\",RIGHT(T9)=\"*\"),\"ff\",IF(BZ9>BZ24,\"t\",IF(BZ9<BZ24,\"u\",\"g\"))))","v":""},null,{"$f":"IF(OR(ISERROR(FIND(\"-\",V9)),AJ9>'export html'!$AR$7),\"\",IF(AND(LEFT(V9)=\"*\",RIGHT(V9)=\"*\"),\"ff\",IF(CB9>CB24,\"t\",IF(CB9<CB24,\"u\",\"g\"))))","v":""},{"$f":"IF(OR(ISERROR(FIND(\"-\",W9)),AK9>'export html'!$AR$7),\"\",IF(AND(LEFT(W9)=\"*\",RIGHT(W9)=\"*\"),\"ff\",IF(CC9>CC24,\"t\",IF(CC9<CC24,\"u\",\"g\"))))","v":""},{"$f":"IF(OR(ISERROR(FIND(\"-\",X9)),AL9>'export html'!$AR$7),\"\",IF(AND(LEFT(X9)=\"*\",RIGHT(X9)=\"*\"),\"ff\",IF(CD9>CD24,\"t\",IF(CD9<CD24,\"u\",\"g\"))))","v":"u"},{"$f":"IF(OR(ISERROR(FIND(\"-\",Y9)),AM9>'export html'!$AR$7),\"\",IF(AND(LEFT(Y9)=\"*\",RIGHT(Y9)=\"*\"),\"ff\",IF(CE9>CE24,\"t\",IF(CE9<CE24,\"u\",\"g\"))))","v":""},{"$f":"IF(OR(ISERROR(FIND(\"-\",Z9)),AN9>'export html'!$AR$7),\"\",IF(AND(LEFT(Z9)=\"*\",RIGHT(Z9)=\"*\"),\"ff\",IF(CF9>CF24,\"t\",IF(CF9<CF24,\"u\",\"g\"))))","v":""},{"$f":"IF(OR(ISERROR(FIND(\"-\",AA9)),AO9>'export html'!$AR$7),\"\",IF(AND(LEFT(AA9)=\"*\",RIGHT(AA9)=\"*\"),\"ff\",IF(CG9>CG24,\"t\",IF(CG9<CG24,\"u\",\"g\"))))","v":""},{"$f":"IF(OR(ISERROR(FIND(\"-\",AB9)),AP9>'export html'!$AR$7),\"\",IF(AND(LEFT(AB9)=\"*\",RIGHT(AB9)=\"*\"),\"ff\",IF(CH9>CH24,\"t\",IF(CH9<CH24,\"u\",\"g\"))))","v":"u"},{"$f":"IF(OR(ISERROR(FIND(\"-\",AC9)),AQ9>'export html'!$AR$7),\"\",IF(AND(LEFT(AC9)=\"*\",RIGHT(AC9)=\"*\"),\"ff\",IF(CI9>CI24,\"t\",IF(CI9<CI24,\"u\",\"g\"))))","v":""},{"$f":"IF(OR(ISERROR(FIND(\"-\",AD9)),AR9>'export html'!$AR$7),\"\",IF(AND(LEFT(AD9)=\"*\",RIGHT(AD9)=\"*\"),\"ff\",IF(CJ9>CJ24,\"t\",IF(CJ9<CJ24,\"u\",\"g\"))))","v":""},5,{"$f":"IF(OR(ISERROR(FIND(\"-\",Q9)),AE9<='export html'!$AR$7),\"\",IF(AND(LEFT(Q9)=\"*\",RIGHT(Q9)=\"*\"),\"ff\",IF(CL9>CL24,\"t\",IF(CL9<CL24,\"u\",\"g\"))))","v":""},{"$f":"IF(OR(ISERROR(FIND(\"-\",R9)),AF9<='export html'!$AR$7),\"\",IF(AND(LEFT(R9)=\"*\",RIGHT(R9)=\"*\"),\"ff\",IF(CM9>CM24,\"t\",IF(CM9<CM24,\"u\",\"g\"))))","v":""},{"$f":"IF(OR(ISERROR(FIND(\"-\",S9)),AG9<='export html'!$AR$7),\"\",IF(AND(LEFT(S9)=\"*\",RIGHT(S9)=\"*\"),\"ff\",IF(CN9>CN24,\"t\",IF(CN9<CN24,\"u\",\"g\"))))","v":""},{"$f":"IF(OR(ISERROR(FIND(\"-\",T9)),AH9<='export html'!$AR$7),\"\",IF(AND(LEFT(T9)=\"*\",RIGHT(T9)=\"*\"),\"ff\",IF(CO9>CO24,\"t\",IF(CO9<CO24,\"u\",\"g\"))))","v":""},null,{"$f":"IF(OR(ISERROR(FIND(\"-\",V9)),AJ9<='export html'!$AR$7),\"\",IF(AND(LEFT(V9)=\"*\",RIGHT(V9)=\"*\"),\"ff\",IF(CQ9>CQ24,\"t\",IF(CQ9<CQ24,\"u\",\"g\"))))","v":""},{"$f":"IF(OR(ISERROR(FIND(\"-\",W9)),AK9<='export html'!$AR$7),\"\",IF(AND(LEFT(W9)=\"*\",RIGHT(W9)=\"*\"),\"ff\",IF(CR9>CR24,\"t\",IF(CR9<CR24,\"u\",\"g\"))))","v":""},{"$f":"IF(OR(ISERROR(FIND(\"-\",X9)),AL9<='export html'!$AR$7),\"\",IF(AND(LEFT(X9)=\"*\",RIGHT(X9)=\"*\"),\"ff\",IF(CS9>CS24,\"t\",IF(CS9<CS24,\"u\",\"g\"))))","v":""},{"$f":"IF(OR(ISERROR(FIND(\"-\",Y9)),AM9<='export html'!$AR$7),\"\",IF(AND(LEFT(Y9)=\"*\",RIGHT(Y9)=\"*\"),\"ff\",IF(CT9>CT24,\"t\",IF(CT9<CT24,\"u\",\"g\"))))","v":""},{"$f":"IF(OR(ISERROR(FIND(\"-\",Z9)),AN9<='export html'!$AR$7),\"\",IF(AND(LEFT(Z9)=\"*\",RIGHT(Z9)=\"*\"),\"ff\",IF(CU9>CU24,\"t\",IF(CU9<CU24,\"u\",\"g\"))))","v":""},{"$f":"IF(OR(ISERROR(FIND(\"-\",AA9)),AO9<='export html'!$AR$7),\"\",IF(AND(LEFT(AA9)=\"*\",RIGHT(AA9)=\"*\"),\"ff\",IF(CV9>CV24,\"t\",IF(CV9<CV24,\"u\",\"g\"))))","v":""},{"$f":"IF(OR(ISERROR(FIND(\"-\",AB9)),AP9<='export html'!$AR$7),\"\",IF(AND(LEFT(AB9)=\"*\",RIGHT(AB9)=\"*\"),\"ff\",IF(CW9>CW24,\"t\",IF(CW9<CW24,\"u\",\"g\"))))","v":""},{"$f":"IF(OR(ISERROR(FIND(\"-\",AC9)),AQ9<='export html'!$AR$7),\"\",IF(AND(LEFT(AC9)=\"*\",RIGHT(AC9)=\"*\"),\"ff\",IF(CX9>CX24,\"t\",IF(CX9<CX24,\"u\",\"g\"))))","v":""},{"$f":"IF(OR(ISERROR(FIND(\"-\",AD9)),AR9<='export html'!$AR$7),\"\",IF(AND(LEFT(AD9)=\"*\",RIGHT(AD9)=\"*\"),\"ff\",IF(CY9>CY24,\"t\",IF(CY9<CY24,\"u\",\"g\"))))","v":""},5]
[null,null,null,null,null,null,null,null,null,null,null,null,null,null,null,null,null,null,null,null,null,null,null,null,null,null,null,null,null,null,null,null,null,null,null,null,null,null,null,null,null,null,null,null,null,null,null,null,null,null,null,null,null,null,null,null,null,null,null,null,null,null,null,null,null,null,null,null,null,null,null,null,null,6,{"$f":"IF(OR(ISERROR(FIND(\"-\",Q10)),AE10>'export html'!$AR$7),\"\",IF(AND(LEFT(Q10)=\"*\",RIGHT(Q10)=\"*\"),\"ff\",IF(BW10>BW25,\"t\",IF(BW10<BW25,\"u\",\"g\"))))","v":""},{"$f":"IF(OR(ISERROR(FIND(\"-\",R10)),AF10>'export html'!$AR$7),\"\",IF(AND(LEFT(R10)=\"*\",RIGHT(R10)=\"*\"),\"ff\",IF(BX10>BX25,\"t\",IF(BX10<BX25,\"u\",\"g\"))))","v":""},{"$f":"IF(OR(ISERROR(FIND(\"-\",S10)),AG10>'export html'!$AR$7),\"\",IF(AND(LEFT(S10)=\"*\",RIGHT(S10)=\"*\"),\"ff\",IF(BY10>BY25,\"t\",IF(BY10<BY25,\"u\",\"g\"))))","v":""},{"$f":"IF(OR(ISERROR(FIND(\"-\",T10)),AH10>'export html'!$AR$7),\"\",IF(AND(LEFT(T10)=\"*\",RIGHT(T10)=\"*\"),\"ff\",IF(BZ10>BZ25,\"t\",IF(BZ10<BZ25,\"u\",\"g\"))))","v":""},{"$f":"IF(OR(ISERROR(FIND(\"-\",U10)),AI10>'export html'!$AR$7),\"\",IF(AND(LEFT(U10)=\"*\",RIGHT(U10)=\"*\"),\"ff\",IF(CA10>CA25,\"t\",IF(CA10<CA25,\"u\",\"g\"))))","v":"t"},null,{"$f":"IF(OR(ISERROR(FIND(\"-\",W10)),AK10>'export html'!$AR$7),\"\",IF(AND(LEFT(W10)=\"*\",RIGHT(W10)=\"*\"),\"ff\",IF(CC10>CC25,\"t\",IF(CC10<CC25,\"u\",\"g\"))))","v":""},{"$f":"IF(OR(ISERROR(FIND(\"-\",X10)),AL10>'export html'!$AR$7),\"\",IF(AND(LEFT(X10)=\"*\",RIGHT(X10)=\"*\"),\"ff\",IF(CD10>CD25,\"t\",IF(CD10<CD25,\"u\",\"g\"))))","v":""},{"$f":"IF(OR(ISERROR(FIND(\"-\",Y10)),AM10>'export html'!$AR$7),\"\",IF(AND(LEFT(Y10)=\"*\",RIGHT(Y10)=\"*\"),\"ff\",IF(CE10>CE25,\"t\",IF(CE10<CE25,\"u\",\"g\"))))","v":""},{"$f":"IF(OR(ISERROR(FIND(\"-\",Z10)),AN10>'export html'!$AR$7),\"\",IF(AND(LEFT(Z10)=\"*\",RIGHT(Z10)=\"*\"),\"ff\",IF(CF10>CF25,\"t\",IF(CF10<CF25,\"u\",\"g\"))))","v":"t"},{"$f":"IF(OR(ISERROR(FIND(\"-\",AA10)),AO10>'export html'!$AR$7),\"\",IF(AND(LEFT(AA10)=\"*\",RIGHT(AA10)=\"*\"),\"ff\",IF(CG10>CG25,\"t\",IF(CG10<CG25,\"u\",\"g\"))))","v":""},{"$f":"IF(OR(ISERROR(FIND(\"-\",AB10)),AP10>'export html'!$AR$7),\"\",IF(AND(LEFT(AB10)=\"*\",RIGHT(AB10)=\"*\"),\"ff\",IF(CH10>CH25,\"t\",IF(CH10<CH25,\"u\",\"g\"))))","v":""},{"$f":"IF(OR(ISERROR(FIND(\"-\",AC10)),AQ10>'export html'!$AR$7),\"\",IF(AND(LEFT(AC10)=\"*\",RIGHT(AC10)=\"*\"),\"ff\",IF(CI10>CI25,\"t\",IF(CI10<CI25,\"u\",\"g\"))))","v":"t"},{"$f":"IF(OR(ISERROR(FIND(\"-\",AD10)),AR10>'export html'!$AR$7),\"\",IF(AND(LEFT(AD10)=\"*\",RIGHT(AD10)=\"*\"),\"ff\",IF(CJ10>CJ25,\"t\",IF(CJ10<CJ25,\"u\",\"g\"))))","v":""},6,{"$f":"IF(OR(ISERROR(FIND(\"-\",Q10)),AE10<='export html'!$AR$7),\"\",IF(AND(LEFT(Q10)=\"*\",RIGHT(Q10)=\"*\"),\"ff\",IF(CL10>CL25,\"t\",IF(CL10<CL25,\"u\",\"g\"))))","v":""},{"$f":"IF(OR(ISERROR(FIND(\"-\",R10)),AF10<='export html'!$AR$7),\"\",IF(AND(LEFT(R10)=\"*\",RIGHT(R10)=\"*\"),\"ff\",IF(CM10>CM25,\"t\",IF(CM10<CM25,\"u\",\"g\"))))","v":""},{"$f":"IF(OR(ISERROR(FIND(\"-\",S10)),AG10<='export html'!$AR$7),\"\",IF(AND(LEFT(S10)=\"*\",RIGHT(S10)=\"*\"),\"ff\",IF(CN10>CN25,\"t\",IF(CN10<CN25,\"u\",\"g\"))))","v":""},{"$f":"IF(OR(ISERROR(FIND(\"-\",T10)),AH10<='export html'!$AR$7),\"\",IF(AND(LEFT(T10)=\"*\",RIGHT(T10)=\"*\"),\"ff\",IF(CO10>CO25,\"t\",IF(CO10<CO25,\"u\",\"g\"))))","v":""},{"$f":"IF(OR(ISERROR(FIND(\"-\",U10)),AI10<='export html'!$AR$7),\"\",IF(AND(LEFT(U10)=\"*\",RIGHT(U10)=\"*\"),\"ff\",IF(CP10>CP25,\"t\",IF(CP10<CP25,\"u\",\"g\"))))","v":""},null,{"$f":"IF(OR(ISERROR(FIND(\"-\",W10)),AK10<='export html'!$AR$7),\"\",IF(AND(LEFT(W10)=\"*\",RIGHT(W10)=\"*\"),\"ff\",IF(CR10>CR25,\"t\",IF(CR10<CR25,\"u\",\"g\"))))","v":""},{"$f":"IF(OR(ISERROR(FIND(\"-\",X10)),AL10<='export html'!$AR$7),\"\",IF(AND(LEFT(X10)=\"*\",RIGHT(X10)=\"*\"),\"ff\",IF(CS10>CS25,\"t\",IF(CS10<CS25,\"u\",\"g\"))))","v":""},{"$f":"IF(OR(ISERROR(FIND(\"-\",Y10)),AM10<='export html'!$AR$7),\"\",IF(AND(LEFT(Y10)=\"*\",RIGHT(Y10)=\"*\"),\"ff\",IF(CT10>CT25,\"t\",IF(CT10<CT25,\"u\",\"g\"))))","v":""},{"$f":"IF(OR(ISERROR(FIND(\"-\",Z10)),AN10<='export html'!$AR$7),\"\",IF(AND(LEFT(Z10)=\"*\",RIGHT(Z10)=\"*\"),\"ff\",IF(CU10>CU25,\"t\",IF(CU10<CU25,\"u\",\"g\"))))","v":""},{"$f":"IF(OR(ISERROR(FIND(\"-\",AA10)),AO10<='export html'!$AR$7),\"\",IF(AND(LEFT(AA10)=\"*\",RIGHT(AA10)=\"*\"),\"ff\",IF(CV10>CV25,\"t\",IF(CV10<CV25,\"u\",\"g\"))))","v":""},{"$f":"IF(OR(ISERROR(FIND(\"-\",AB10)),AP10<='export html'!$AR$7),\"\",IF(AND(LEFT(AB10)=\"*\",RIGHT(AB10)=\"*\"),\"ff\",IF(CW10>CW25,\"t\",IF(CW10<CW25,\"u\",\"g\"))))","v":""},{"$f":"IF(OR(ISERROR(FIND(\"-\",AC10)),AQ10<='export html'!$AR$7),\"\",IF(AND(LEFT(AC10)=\"*\",RIGHT(AC10)=\"*\"),\"ff\",IF(CX10>CX25,\"t\",IF(CX10<CX25,\"u\",\"g\"))))","v":""},{"$f":"IF(OR(ISERROR(FIND(\"-\",AD10)),AR10<='export html'!$AR$7),\"\",IF(AND(LEFT(AD10)=\"*\",RIGHT(AD10)=\"*\"),\"ff\",IF(CY10>CY25,\"t\",IF(CY10<CY25,\"u\",\"g\"))))","v":""},6]
[null,null,null,null,null,null,null,null,null,null,null,null,null,null,null,null,null,null,null,null,null,null,null,null,null,null,null,null,null,null,null,null,null,null,null,null,null,null,null,null,null,null,null,null,null,null,null,null,null,null,null,null,null,null,null,null,null,null,null,null,null,null,null,null,null,null,null,null,null,null,null,null,null,7,{"$f":"IF(OR(ISERROR(FIND(\"-\",Q11)),AE11>'export html'!$AR$7),\"\",IF(AND(LEFT(Q11)=\"*\",RIGHT(Q11)=\"*\"),\"ff\",IF(BW11>BW26,\"t\",IF(BW11<BW26,\"u\",\"g\"))))","v":""},{"$f":"IF(OR(ISERROR(FIND(\"-\",R11)),AF11>'export html'!$AR$7),\"\",IF(AND(LEFT(R11)=\"*\",RIGHT(R11)=\"*\"),\"ff\",IF(BX11>BX26,\"t\",IF(BX11<BX26,\"u\",\"g\"))))","v":""},{"$f":"IF(OR(ISERROR(FIND(\"-\",S11)),AG11>'export html'!$AR$7),\"\",IF(AND(LEFT(S11)=\"*\",RIGHT(S11)=\"*\"),\"ff\",IF(BY11>BY26,\"t\",IF(BY11<BY26,\"u\",\"g\"))))","v":""},{"$f":"IF(OR(ISERROR(FIND(\"-\",T11)),AH11>'export html'!$AR$7),\"\",IF(AND(LEFT(T11)=\"*\",RIGHT(T11)=\"*\"),\"ff\",IF(BZ11>BZ26,\"t\",IF(BZ11<BZ26,\"u\",\"g\"))))","v":"t"},{"$f":"IF(OR(ISERROR(FIND(\"-\",U11)),AI11>'export html'!$AR$7),\"\",IF(AND(LEFT(U11)=\"*\",RIGHT(U11)=\"*\"),\"ff\",IF(CA11>CA26,\"t\",IF(CA11<CA26,\"u\",\"g\"))))","v":""},{"$f":"IF(OR(ISERROR(FIND(\"-\",V11)),AJ11>'export html'!$AR$7),\"\",IF(AND(LEFT(V11)=\"*\",RIGHT(V11)=\"*\"),\"ff\",IF(CB11>CB26,\"t\",IF(CB11<CB26,\"u\",\"g\"))))","v":""},null,{"$f":"IF(OR(ISERROR(FIND(\"-\",X11)),AL11>'export html'!$AR$7),\"\",IF(AND(LEFT(X11)=\"*\",RIGHT(X11)=\"*\"),\"ff\",IF(CD11>CD26,\"t\",IF(CD11<CD26,\"u\",\"g\"))))","v":""},{"$f":"IF(OR(ISERROR(FIND(\"-\",Y11)),AM11>'export html'!$AR$7),\"\",IF(AND(LEFT(Y11)=\"*\",RIGHT(Y11)=\"*\"),\"ff\",IF(CE11>CE26,\"t\",IF(CE11<CE26,\"u\",\"g\"))))","v":""},{"$f":"IF(OR(ISERROR(FIND(\"-\",Z11)),AN11>'export html'!$AR$7),\"\",IF(AND(LEFT(Z11)=\"*\",RIGHT(Z11)=\"*\"),\"ff\",IF(CF11>CF26,\"t\",IF(CF11<CF26,\"u\",\"g\"))))","v":"t"},{"$f":"IF(OR(ISERROR(FIND(\"-\",AA11)),AO11>'export html'!$AR$7),\"\",IF(AND(LEFT(AA11)=\"*\",RIGHT(AA11)=\"*\"),\"ff\",IF(CG11>CG26,\"t\",IF(CG11<CG26,\"u\",\"g\"))))","v":"u"},{"$f":"IF(OR(ISERROR(FIND(\"-\",AB11)),AP11>'export html'!$AR$7),\"\",IF(AND(LEFT(AB11)=\"*\",RIGHT(AB11)=\"*\"),\"ff\",IF(CH11>CH26,\"t\",IF(CH11<CH26,\"u\",\"g\"))))","v":""},{"$f":"IF(OR(ISERROR(FIND(\"-\",AC11)),AQ11>'export html'!$AR$7),\"\",IF(AND(LEFT(AC11)=\"*\",RIGHT(AC11)=\"*\"),\"ff\",IF(CI11>CI26,\"t\",IF(CI11<CI26,\"u\",\"g\"))))","v":""},{"$f":"IF(OR(ISERROR(FIND(\"-\",AD11)),AR11>'export html'!$AR$7),\"\",IF(AND(LEFT(AD11)=\"*\",RIGHT(AD11)=\"*\"),\"ff\",IF(CJ11>CJ26,\"t\",IF(CJ11<CJ26,\"u\",\"g\"))))","v":""},7,{"$f":"IF(OR(ISERROR(FIND(\"-\",Q11)),AE11<='export html'!$AR$7),\"\",IF(AND(LEFT(Q11)=\"*\",RIGHT(Q11)=\"*\"),\"ff\",IF(CL11>CL26,\"t\",IF(CL11<CL26,\"u\",\"g\"))))","v":""},{"$f":"IF(OR(ISERROR(FIND(\"-\",R11)),AF11<='export html'!$AR$7),\"\",IF(AND(LEFT(R11)=\"*\",RIGHT(R11)=\"*\"),\"ff\",IF(CM11>CM26,\"t\",IF(CM11<CM26,\"u\",\"g\"))))","v":""},{"$f":"IF(OR(ISERROR(FIND(\"-\",S11)),AG11<='export html'!$AR$7),\"\",IF(AND(LEFT(S11)=\"*\",RIGHT(S11)=\"*\"),\"ff\",IF(CN11>CN26,\"t\",IF(CN11<CN26,\"u\",\"g\"))))","v":""},{"$f":"IF(OR(ISERROR(FIND(\"-\",T11)),AH11<='export html'!$AR$7),\"\",IF(AND(LEFT(T11)=\"*\",RIGHT(T11)=\"*\"),\"ff\",IF(CO11>CO26,\"t\",IF(CO11<CO26,\"u\",\"g\"))))","v":""},{"$f":"IF(OR(ISERROR(FIND(\"-\",U11)),AI11<='export html'!$AR$7),\"\",IF(AND(LEFT(U11)=\"*\",RIGHT(U11)=\"*\"),\"ff\",IF(CP11>CP26,\"t\",IF(CP11<CP26,\"u\",\"g\"))))","v":""},{"$f":"IF(OR(ISERROR(FIND(\"-\",V11)),AJ11<='export html'!$AR$7),\"\",IF(AND(LEFT(V11)=\"*\",RIGHT(V11)=\"*\"),\"ff\",IF(CQ11>CQ26,\"t\",IF(CQ11<CQ26,\"u\",\"g\"))))","v":""},null,{"$f":"IF(OR(ISERROR(FIND(\"-\",X11)),AL11<='export html'!$AR$7),\"\",IF(AND(LEFT(X11)=\"*\",RIGHT(X11)=\"*\"),\"ff\",IF(CS11>CS26,\"t\",IF(CS11<CS26,\"u\",\"g\"))))","v":""},{"$f":"IF(OR(ISERROR(FIND(\"-\",Y11)),AM11<='export html'!$AR$7),\"\",IF(AND(LEFT(Y11)=\"*\",RIGHT(Y11)=\"*\"),\"ff\",IF(CT11>CT26,\"t\",IF(CT11<CT26,\"u\",\"g\"))))","v":""},{"$f":"IF(OR(ISERROR(FIND(\"-\",Z11)),AN11<='export html'!$AR$7),\"\",IF(AND(LEFT(Z11)=\"*\",RIGHT(Z11)=\"*\"),\"ff\",IF(CU11>CU26,\"t\",IF(CU11<CU26,\"u\",\"g\"))))","v":""},{"$f":"IF(OR(ISERROR(FIND(\"-\",AA11)),AO11<='export html'!$AR$7),\"\",IF(AND(LEFT(AA11)=\"*\",RIGHT(AA11)=\"*\"),\"ff\",IF(CV11>CV26,\"t\",IF(CV11<CV26,\"u\",\"g\"))))","v":""},{"$f":"IF(OR(ISERROR(FIND(\"-\",AB11)),AP11<='export html'!$AR$7),\"\",IF(AND(LEFT(AB11)=\"*\",RIGHT(AB11)=\"*\"),\"ff\",IF(CW11>CW26,\"t\",IF(CW11<CW26,\"u\",\"g\"))))","v":""},{"$f":"IF(OR(ISERROR(FIND(\"-\",AC11)),AQ11<='export html'!$AR$7),\"\",IF(AND(LEFT(AC11)=\"*\",RIGHT(AC11)=\"*\"),\"ff\",IF(CX11>CX26,\"t\",IF(CX11<CX26,\"u\",\"g\"))))","v":""},{"$f":"IF(OR(ISERROR(FIND(\"-\",AD11)),AR11<='export html'!$AR$7),\"\",IF(AND(LEFT(AD11)=\"*\",RIGHT(AD11)=\"*\"),\"ff\",IF(CY11>CY26,\"t\",IF(CY11<CY26,\"u\",\"g\"))))","v":""},7]
[null,null,null,null,null,null,null,null,null,null,null,null,null,null,null,null,null,null,null,null,null,null,null,null,null,null,null,null,null,null,null,null,null,null,null,null,null,null,null,null,null,null,null,null,null,null,null,null,null,null,null,null,null,null,null,null,null,null,null,null,null,null,null,null,null,null,null,null,null,null,null,null,null,8,{"$f":"IF(OR(ISERROR(FIND(\"-\",Q12)),AE12>'export html'!$AR$7),\"\",IF(AND(LEFT(Q12)=\"*\",RIGHT(Q12)=\"*\"),\"ff\",IF(BW12>BW27,\"t\",IF(BW12<BW27,\"u\",\"g\"))))","v":""},{"$f":"IF(OR(ISERROR(FIND(\"-\",R12)),AF12>'export html'!$AR$7),\"\",IF(AND(LEFT(R12)=\"*\",RIGHT(R12)=\"*\"),\"ff\",IF(BX12>BX27,\"t\",IF(BX12<BX27,\"u\",\"g\"))))","v":""},{"$f":"IF(OR(ISERROR(FIND(\"-\",S12)),AG12>'export html'!$AR$7),\"\",IF(AND(LEFT(S12)=\"*\",RIGHT(S12)=\"*\"),\"ff\",IF(BY12>BY27,\"t\",IF(BY12<BY27,\"u\",\"g\"))))","v":""},{"$f":"IF(OR(ISERROR(FIND(\"-\",T12)),AH12>'export html'!$AR$7),\"\",IF(AND(LEFT(T12)=\"*\",RIGHT(T12)=\"*\"),\"ff\",IF(BZ12>BZ27,\"t\",IF(BZ12<BZ27,\"u\",\"g\"))))","v":""},{"$f":"IF(OR(ISERROR(FIND(\"-\",U12)),AI12>'export html'!$AR$7),\"\",IF(AND(LEFT(U12)=\"*\",RIGHT(U12)=\"*\"),\"ff\",IF(CA12>CA27,\"t\",IF(CA12<CA27,\"u\",\"g\"))))","v":""},{"$f":"IF(OR(ISERROR(FIND(\"-\",V12)),AJ12>'export html'!$AR$7),\"\",IF(AND(LEFT(V12)=\"*\",RIGHT(V12)=\"*\"),\"ff\",IF(CB12>CB27,\"t\",IF(CB12<CB27,\"u\",\"g\"))))","v":"u"},{"$f":"IF(OR(ISERROR(FIND(\"-\",W12)),AK12>'export html'!$AR$7),\"\",IF(AND(LEFT(W12)=\"*\",RIGHT(W12)=\"*\"),\"ff\",IF(CC12>CC27,\"t\",IF(CC12<CC27,\"u\",\"g\"))))","v":""},null,{"$f":"IF(OR(ISERROR(FIND(\"-\",Y12)),AM12>'export html'!$AR$7),\"\",IF(AND(LEFT(Y12)=\"*\",RIGHT(Y12)=\"*\"),\"ff\",IF(CE12>CE27,\"t\",IF(CE12<CE27,\"u\",\"g\"))))","v":""},{"$f":"IF(OR(ISERROR(FIND(\"-\",Z12)),AN12>'export html'!$AR$7),\"\",IF(AND(LEFT(Z12)=\"*\",RIGHT(Z12)=\"*\"),\"ff\",IF(CF12>CF27,\"t\",IF(CF12<CF27,\"u\",\"g\"))))","v":""},{"$f":"IF(OR(ISERROR(FIND(\"-\",AA12)),AO12>'export html'!$AR$7),\"\",IF(AND(LEFT(AA12)=\"*\",RIGHT(AA12)=\"*\"),\"ff\",IF(CG12>CG27,\"t\",IF(CG12<CG27,\"u\",\"g\"))))","v":""},{"$f":"IF(OR(ISERROR(FIND(\"-\",AB12)),AP12>'export html'!$AR$7),\"\",IF(AND(LEFT(AB12)=\"*\",RIGHT(AB12)=\"*\"),\"ff\",IF(CH12>CH27,\"t\",IF(CH12<CH27,\"u\",\"g\"))))","v":"u"},{"$f":"IF(OR(ISERROR(FIND(\"-\",AC12)),AQ12>'export html'!$AR$7),\"\",IF(AND(LEFT(AC12)=\"*\",RIGHT(AC12)=\"*\"),\"ff\",IF(CI12>CI27,\"t\",IF(CI12<CI27,\"u\",\"g\"))))","v":""},{"$f":"IF(OR(ISERROR(FIND(\"-\",AD12)),AR12>'export html'!$AR$7),\"\",IF(AND(LEFT(AD12)=\"*\",RIGHT(AD12)=\"*\"),\"ff\",IF(CJ12>CJ27,\"t\",IF(CJ12<CJ27,\"u\",\"g\"))))","v":"g"},8,{"$f":"IF(OR(ISERROR(FIND(\"-\",Q12)),AE12<='export html'!$AR$7),\"\",IF(AND(LEFT(Q12)=\"*\",RIGHT(Q12)=\"*\"),\"ff\",IF(CL12>CL27,\"t\",IF(CL12<CL27,\"u\",\"g\"))))","v":""},{"$f":"IF(OR(ISERROR(FIND(\"-\",R12)),AF12<='export html'!$AR$7),\"\",IF(AND(LEFT(R12)=\"*\",RIGHT(R12)=\"*\"),\"ff\",IF(CM12>CM27,\"t\",IF(CM12<CM27,\"u\",\"g\"))))","v":""},{"$f":"IF(OR(ISERROR(FIND(\"-\",S12)),AG12<='export html'!$AR$7),\"\",IF(AND(LEFT(S12)=\"*\",RIGHT(S12)=\"*\"),\"ff\",IF(CN12>CN27,\"t\",IF(CN12<CN27,\"u\",\"g\"))))","v":""},{"$f":"IF(OR(ISERROR(FIND(\"-\",T12)),AH12<='export html'!$AR$7),\"\",IF(AND(LEFT(T12)=\"*\",RIGHT(T12)=\"*\"),\"ff\",IF(CO12>CO27,\"t\",IF(CO12<CO27,\"u\",\"g\"))))","v":""},{"$f":"IF(OR(ISERROR(FIND(\"-\",U12)),AI12<='export html'!$AR$7),\"\",IF(AND(LEFT(U12)=\"*\",RIGHT(U12)=\"*\"),\"ff\",IF(CP12>CP27,\"t\",IF(CP12<CP27,\"u\",\"g\"))))","v":""},{"$f":"IF(OR(ISERROR(FIND(\"-\",V12)),AJ12<='export html'!$AR$7),\"\",IF(AND(LEFT(V12)=\"*\",RIGHT(V12)=\"*\"),\"ff\",IF(CQ12>CQ27,\"t\",IF(CQ12<CQ27,\"u\",\"g\"))))","v":""},{"$f":"IF(OR(ISERROR(FIND(\"-\",W12)),AK12<='export html'!$AR$7),\"\",IF(AND(LEFT(W12)=\"*\",RIGHT(W12)=\"*\"),\"ff\",IF(CR12>CR27,\"t\",IF(CR12<CR27,\"u\",\"g\"))))","v":""},null,{"$f":"IF(OR(ISERROR(FIND(\"-\",Y12)),AM12<='export html'!$AR$7),\"\",IF(AND(LEFT(Y12)=\"*\",RIGHT(Y12)=\"*\"),\"ff\",IF(CT12>CT27,\"t\",IF(CT12<CT27,\"u\",\"g\"))))","v":""},{"$f":"IF(OR(ISERROR(FIND(\"-\",Z12)),AN12<='export html'!$AR$7),\"\",IF(AND(LEFT(Z12)=\"*\",RIGHT(Z12)=\"*\"),\"ff\",IF(CU12>CU27,\"t\",IF(CU12<CU27,\"u\",\"g\"))))","v":""},{"$f":"IF(OR(ISERROR(FIND(\"-\",AA12)),AO12<='export html'!$AR$7),\"\",IF(AND(LEFT(AA12)=\"*\",RIGHT(AA12)=\"*\"),\"ff\",IF(CV12>CV27,\"t\",IF(CV12<CV27,\"u\",\"g\"))))","v":""},{"$f":"IF(OR(ISERROR(FIND(\"-\",AB12)),AP12<='export html'!$AR$7),\"\",IF(AND(LEFT(AB12)=\"*\",RIGHT(AB12)=\"*\"),\"ff\",IF(CW12>CW27,\"t\",IF(CW12<CW27,\"u\",\"g\"))))","v":""},{"$f":"IF(OR(ISERROR(FIND(\"-\",AC12)),AQ12<='export html'!$AR$7),\"\",IF(AND(LEFT(AC12)=\"*\",RIGHT(AC12)=\"*\"),\"ff\",IF(CX12>CX27,\"t\",IF(CX12<CX27,\"u\",\"g\"))))","v":""},{"$f":"IF(OR(ISERROR(FIND(\"-\",AD12)),AR12<='export html'!$AR$7),\"\",IF(AND(LEFT(AD12)=\"*\",RIGHT(AD12)=\"*\"),\"ff\",IF(CY12>CY27,\"t\",IF(CY12<CY27,\"u\",\"g\"))))","v":""},8]
[null,null,null,null,null,null,null,null,null,null,null,null,null,null,null,null,null,null,null,null,null,null,null,null,null,null,null,null,null,null,null,null,null,null,null,null,null,null,null,null,null,null,null,null,null,null,null,null,null,null,null,null,null,null,null,null,null,null,null,null,null,null,null,null,null,null,null,null,null,null,null,null,null,9,{"$f":"IF(OR(ISERROR(FIND(\"-\",Q13)),AE13>'export html'!$AR$7),\"\",IF(AND(LEFT(Q13)=\"*\",RIGHT(Q13)=\"*\"),\"ff\",IF(BW13>BW28,\"t\",IF(BW13<BW28,\"u\",\"g\"))))","v":""},{"$f":"IF(OR(ISERROR(FIND(\"-\",R13)),AF13>'export html'!$AR$7),\"\",IF(AND(LEFT(R13)=\"*\",RIGHT(R13)=\"*\"),\"ff\",IF(BX13>BX28,\"t\",IF(BX13<BX28,\"u\",\"g\"))))","v":""},{"$f":"IF(OR(ISERROR(FIND(\"-\",S13)),AG13>'export html'!$AR$7),\"\",IF(AND(LEFT(S13)=\"*\",RIGHT(S13)=\"*\"),\"ff\",IF(BY13>BY28,\"t\",IF(BY13<BY28,\"u\",\"g\"))))","v":""},{"$f":"IF(OR(ISERROR(FIND(\"-\",T13)),AH13>'export html'!$AR$7),\"\",IF(AND(LEFT(T13)=\"*\",RIGHT(T13)=\"*\"),\"ff\",IF(BZ13>BZ28,\"t\",IF(BZ13<BZ28,\"u\",\"g\"))))","v":""},{"$f":"IF(OR(ISERROR(FIND(\"-\",U13)),AI13>'export html'!$AR$7),\"\",IF(AND(LEFT(U13)=\"*\",RIGHT(U13)=\"*\"),\"ff\",IF(CA13>CA28,\"t\",IF(CA13<CA28,\"u\",\"g\"))))","v":"u"},{"$f":"IF(OR(ISERROR(FIND(\"-\",V13)),AJ13>'export html'!$AR$7),\"\",IF(AND(LEFT(V13)=\"*\",RIGHT(V13)=\"*\"),\"ff\",IF(CB13>CB28,\"t\",IF(CB13<CB28,\"u\",\"g\"))))","v":"u"},{"$f":"IF(OR(ISERROR(FIND(\"-\",W13)),AK13>'export html'!$AR$7),\"\",IF(AND(LEFT(W13)=\"*\",RIGHT(W13)=\"*\"),\"ff\",IF(CC13>CC28,\"t\",IF(CC13<CC28,\"u\",\"g\"))))","v":""},{"$f":"IF(OR(ISERROR(FIND(\"-\",X13)),AL13>'export html'!$AR$7),\"\",IF(AND(LEFT(X13)=\"*\",RIGHT(X13)=\"*\"),\"ff\",IF(CD13>CD28,\"t\",IF(CD13<CD28,\"u\",\"g\"))))","v":"u"},null,{"$f":"IF(OR(ISERROR(FIND(\"-\",Z13)),AN13>'export html'!$AR$7),\"\",IF(AND(LEFT(Z13)=\"*\",RIGHT(Z13)=\"*\"),\"ff\",IF(CF13>CF28,\"t\",IF(CF13<CF28,\"u\",\"g\"))))","v":""},{"$f":"IF(OR(ISERROR(FIND(\"-\",AA13)),AO13>'export html'!$AR$7),\"\",IF(AND(LEFT(AA13)=\"*\",RIGHT(AA13)=\"*\"),\"ff\",IF(CG13>CG28,\"t\",IF(CG13<CG28,\"u\",\"g\"))))","v":""},{"$f":"IF(OR(ISERROR(FIND(\"-\",AB13)),AP13>'export html'!$AR$7),\"\",IF(AND(LEFT(AB13)=\"*\",RIGHT(AB13)=\"*\"),\"ff\",IF(CH13>CH28,\"t\",IF(CH13<CH28,\"u\",\"g\"))))","v":""},{"$f":"IF(OR(ISERROR(FIND(\"-\",AC13)),AQ13>'export html'!$AR$7),\"\",IF(AND(LEFT(AC13)=\"*\",RIGHT(AC13)=\"*\"),\"ff\",IF(CI13>CI28,\"t\",IF(CI13<CI28,\"u\",\"g\"))))","v":""},{"$f":"IF(OR(ISERROR(FIND(\"-\",AD13)),AR13>'export html'!$AR$7),\"\",IF(AND(LEFT(AD13)=\"*\",RIGHT(AD13)=\"*\"),\"ff\",IF(CJ13>CJ28,\"t\",IF(CJ13<CJ28,\"u\",\"g\"))))","v":""},9,{"$f":"IF(OR(ISERROR(FIND(\"-\",Q13)),AE13<='export html'!$AR$7),\"\",IF(AND(LEFT(Q13)=\"*\",RIGHT(Q13)=\"*\"),\"ff\",IF(CL13>CL28,\"t\",IF(CL13<CL28,\"u\",\"g\"))))","v":""},{"$f":"IF(OR(ISERROR(FIND(\"-\",R13)),AF13<='export html'!$AR$7),\"\",IF(AND(LEFT(R13)=\"*\",RIGHT(R13)=\"*\"),\"ff\",IF(CM13>CM28,\"t\",IF(CM13<CM28,\"u\",\"g\"))))","v":""},{"$f":"IF(OR(ISERROR(FIND(\"-\",S13)),AG13<='export html'!$AR$7),\"\",IF(AND(LEFT(S13)=\"*\",RIGHT(S13)=\"*\"),\"ff\",IF(CN13>CN28,\"t\",IF(CN13<CN28,\"u\",\"g\"))))","v":""},{"$f":"IF(OR(ISERROR(FIND(\"-\",T13)),AH13<='export html'!$AR$7),\"\",IF(AND(LEFT(T13)=\"*\",RIGHT(T13)=\"*\"),\"ff\",IF(CO13>CO28,\"t\",IF(CO13<CO28,\"u\",\"g\"))))","v":""},{"$f":"IF(OR(ISERROR(FIND(\"-\",U13)),AI13<='export html'!$AR$7),\"\",IF(AND(LEFT(U13)=\"*\",RIGHT(U13)=\"*\"),\"ff\",IF(CP13>CP28,\"t\",IF(CP13<CP28,\"u\",\"g\"))))","v":""},{"$f":"IF(OR(ISERROR(FIND(\"-\",V13)),AJ13<='export html'!$AR$7),\"\",IF(AND(LEFT(V13)=\"*\",RIGHT(V13)=\"*\"),\"ff\",IF(CQ13>CQ28,\"t\",IF(CQ13<CQ28,\"u\",\"g\"))))","v":""},{"$f":"IF(OR(ISERROR(FIND(\"-\",W13)),AK13<='export html'!$AR$7),\"\",IF(AND(LEFT(W13)=\"*\",RIGHT(W13)=\"*\"),\"ff\",IF(CR13>CR28,\"t\",IF(CR13<CR28,\"u\",\"g\"))))","v":""},{"$f":"IF(OR(ISERROR(FIND(\"-\",X13)),AL13<='export html'!$AR$7),\"\",IF(AND(LEFT(X13)=\"*\",RIGHT(X13)=\"*\"),\"ff\",IF(CS13>CS28,\"t\",IF(CS13<CS28,\"u\",\"g\"))))","v":""},null,{"$f":"IF(OR(ISERROR(FIND(\"-\",Z13)),AN13<='export html'!$AR$7),\"\",IF(AND(LEFT(Z13)=\"*\",RIGHT(Z13)=\"*\"),\"ff\",IF(CU13>CU28,\"t\",IF(CU13<CU28,\"u\",\"g\"))))","v":""},{"$f":"IF(OR(ISERROR(FIND(\"-\",AA13)),AO13<='export html'!$AR$7),\"\",IF(AND(LEFT(AA13)=\"*\",RIGHT(AA13)=\"*\"),\"ff\",IF(CV13>CV28,\"t\",IF(CV13<CV28,\"u\",\"g\"))))","v":""},{"$f":"IF(OR(ISERROR(FIND(\"-\",AB13)),AP13<='export html'!$AR$7),\"\",IF(AND(LEFT(AB13)=\"*\",RIGHT(AB13)=\"*\"),\"ff\",IF(CW13>CW28,\"t\",IF(CW13<CW28,\"u\",\"g\"))))","v":""},{"$f":"IF(OR(ISERROR(FIND(\"-\",AC13)),AQ13<='export html'!$AR$7),\"\",IF(AND(LEFT(AC13)=\"*\",RIGHT(AC13)=\"*\"),\"ff\",IF(CX13>CX28,\"t\",IF(CX13<CX28,\"u\",\"g\"))))","v":""},{"$f":"IF(OR(ISERROR(FIND(\"-\",AD13)),AR13<='export html'!$AR$7),\"\",IF(AND(LEFT(AD13)=\"*\",RIGHT(AD13)=\"*\"),\"ff\",IF(CY13>CY28,\"t\",IF(CY13<CY28,\"u\",\"g\"))))","v":""},9]
[null,null,null,null,null,null,null,null,null,null,null,null,null,null,null,null,null,null,null,null,null,null,null,null,null,null,null,null,null,null,null,null,null,null,null,null,null,null,null,null,null,null,null,null,null,null,null,null,null,null,null,null,null,null,null,null,null,null,null,null,null,null,null,null,null,null,null,null,null,null,null,null,null,10,{"$f":"IF(OR(ISERROR(FIND(\"-\",Q14)),AE14>'export html'!$AR$7),\"\",IF(AND(LEFT(Q14)=\"*\",RIGHT(Q14)=\"*\"),\"ff\",IF(BW14>BW29,\"t\",IF(BW14<BW29,\"u\",\"g\"))))","v":"u"},{"$f":"IF(OR(ISERROR(FIND(\"-\",R14)),AF14>'export html'!$AR$7),\"\",IF(AND(LEFT(R14)=\"*\",RIGHT(R14)=\"*\"),\"ff\",IF(BX14>BX29,\"t\",IF(BX14<BX29,\"u\",\"g\"))))","v":""},{"$f":"IF(OR(ISERROR(FIND(\"-\",S14)),AG14>'export html'!$AR$7),\"\",IF(AND(LEFT(S14)=\"*\",RIGHT(S14)=\"*\"),\"ff\",IF(BY14>BY29,\"t\",IF(BY14<BY29,\"u\",\"g\"))))","v":"u"},{"$f":"IF(OR(ISERROR(FIND(\"-\",T14)),AH14>'export html'!$AR$7),\"\",IF(AND(LEFT(T14)=\"*\",RIGHT(T14)=\"*\"),\"ff\",IF(BZ14>BZ29,\"t\",IF(BZ14<BZ29,\"u\",\"g\"))))","v":""},{"$f":"IF(OR(ISERROR(FIND(\"-\",U14)),AI14>'export html'!$AR$7),\"\",IF(AND(LEFT(U14)=\"*\",RIGHT(U14)=\"*\"),\"ff\",IF(CA14>CA29,\"t\",IF(CA14<CA29,\"u\",\"g\"))))","v":""},{"$f":"IF(OR(ISERROR(FIND(\"-\",V14)),AJ14>'export html'!$AR$7),\"\",IF(AND(LEFT(V14)=\"*\",RIGHT(V14)=\"*\"),\"ff\",IF(CB14>CB29,\"t\",IF(CB14<CB29,\"u\",\"g\"))))","v":""},{"$f":"IF(OR(ISERROR(FIND(\"-\",W14)),AK14>'export html'!$AR$7),\"\",IF(AND(LEFT(W14)=\"*\",RIGHT(W14)=\"*\"),\"ff\",IF(CC14>CC29,\"t\",IF(CC14<CC29,\"u\",\"g\"))))","v":""},{"$f":"IF(OR(ISERROR(FIND(\"-\",X14)),AL14>'export html'!$AR$7),\"\",IF(AND(LEFT(X14)=\"*\",RIGHT(X14)=\"*\"),\"ff\",IF(CD14>CD29,\"t\",IF(CD14<CD29,\"u\",\"g\"))))","v":"t"},{"$f":"IF(OR(ISERROR(FIND(\"-\",Y14)),AM14>'export html'!$AR$7),\"\",IF(AND(LEFT(Y14)=\"*\",RIGHT(Y14)=\"*\"),\"ff\",IF(CE14>CE29,\"t\",IF(CE14<CE29,\"u\",\"g\"))))","v":""},null,{"$f":"IF(OR(ISERROR(FIND(\"-\",AA14)),AO14>'export html'!$AR$7),\"\",IF(AND(LEFT(AA14)=\"*\",RIGHT(AA14)=\"*\"),\"ff\",IF(CG14>CG29,\"t\",IF(CG14<CG29,\"u\",\"g\"))))","v":""},{"$f":"IF(OR(ISERROR(FIND(\"-\",AB14)),AP14>'export html'!$AR$7),\"\",IF(AND(LEFT(AB14)=\"*\",RIGHT(AB14)=\"*\"),\"ff\",IF(CH14>CH29,\"t\",IF(CH14<CH29,\"u\",\"g\"))))","v":""},{"$f":"IF(OR(ISERROR(FIND(\"-\",AC14)),AQ14>'export html'!$AR$7),\"\",IF(AND(LEFT(AC14)=\"*\",RIGHT(AC14)=\"*\"),\"ff\",IF(CI14>CI29,\"t\",IF(CI14<CI29,\"u\",\"g\"))))","v":""},{"$f":"IF(OR(ISERROR(FIND(\"-\",AD14)),AR14>'export html'!$AR$7),\"\",IF(AND(LEFT(AD14)=\"*\",RIGHT(AD14)=\"*\"),\"ff\",IF(CJ14>CJ29,\"t\",IF(CJ14<CJ29,\"u\",\"g\"))))","v":""},10,{"$f":"IF(OR(ISERROR(FIND(\"-\",Q14)),AE14<='export html'!$AR$7),\"\",IF(AND(LEFT(Q14)=\"*\",RIGHT(Q14)=\"*\"),\"ff\",IF(CL14>CL29,\"t\",IF(CL14<CL29,\"u\",\"g\"))))","v":""},{"$f":"IF(OR(ISERROR(FIND(\"-\",R14)),AF14<='export html'!$AR$7),\"\",IF(AND(LEFT(R14)=\"*\",RIGHT(R14)=\"*\"),\"ff\",IF(CM14>CM29,\"t\",IF(CM14<CM29,\"u\",\"g\"))))","v":""},{"$f":"IF(OR(ISERROR(FIND(\"-\",S14)),AG14<='export html'!$AR$7),\"\",IF(AND(LEFT(S14)=\"*\",RIGHT(S14)=\"*\"),\"ff\",IF(CN14>CN29,\"t\",IF(CN14<CN29,\"u\",\"g\"))))","v":""},{"$f":"IF(OR(ISERROR(FIND(\"-\",T14)),AH14<='export html'!$AR$7),\"\",IF(AND(LEFT(T14)=\"*\",RIGHT(T14)=\"*\"),\"ff\",IF(CO14>CO29,\"t\",IF(CO14<CO29,\"u\",\"g\"))))","v":""},{"$f":"IF(OR(ISERROR(FIND(\"-\",U14)),AI14<='export html'!$AR$7),\"\",IF(AND(LEFT(U14)=\"*\",RIGHT(U14)=\"*\"),\"ff\",IF(CP14>CP29,\"t\",IF(CP14<CP29,\"u\",\"g\"))))","v":""},{"$f":"IF(OR(ISERROR(FIND(\"-\",V14)),AJ14<='export html'!$AR$7),\"\",IF(AND(LEFT(V14)=\"*\",RIGHT(V14)=\"*\"),\"ff\",IF(CQ14>CQ29,\"t\",IF(CQ14<CQ29,\"u\",\"g\"))))","v":""},{"$f":"IF(OR(ISERROR(FIND(\"-\",W14)),AK14<='export html'!$AR$7),\"\",IF(AND(LEFT(W14)=\"*\",RIGHT(W14)=\"*\"),\"ff\",IF(CR14>CR29,\"t\",IF(CR14<CR29,\"u\",\"g\"))))","v":""},{"$f":"IF(OR(ISERROR(FIND(\"-\",X14)),AL14<='export html'!$AR$7),\"\",IF(AND(LEFT(X14)=\"*\",RIGHT(X14)=\"*\"),\"ff\",IF(CS14>CS29,\"t\",IF(CS14<CS29,\"u\",\"g\"))))","v":""},{"$f":"IF(OR(ISERROR(FIND(\"-\",Y14)),AM14<='export html'!$AR$7),\"\",IF(AND(LEFT(Y14)=\"*\",RIGHT(Y14)=\"*\"),\"ff\",IF(CT14>CT29,\"t\",IF(CT14<CT29,\"u\",\"g\"))))","v":""},null,{"$f":"IF(OR(ISERROR(FIND(\"-\",AA14)),AO14<='export html'!$AR$7),\"\",IF(AND(LEFT(AA14)=\"*\",RIGHT(AA14)=\"*\"),\"ff\",IF(CV14>CV29,\"t\",IF(CV14<CV29,\"u\",\"g\"))))","v":""},{"$f":"IF(OR(ISERROR(FIND(\"-\",AB14)),AP14<='export html'!$AR$7),\"\",IF(AND(LEFT(AB14)=\"*\",RIGHT(AB14)=\"*\"),\"ff\",IF(CW14>CW29,\"t\",IF(CW14<CW29,\"u\",\"g\"))))","v":""},{"$f":"IF(OR(ISERROR(FIND(\"-\",AC14)),AQ14<='export html'!$AR$7),\"\",IF(AND(LEFT(AC14)=\"*\",RIGHT(AC14)=\"*\"),\"ff\",IF(CX14>CX29,\"t\",IF(CX14<CX29,\"u\",\"g\"))))","v":""},{"$f":"IF(OR(ISERROR(FIND(\"-\",AD14)),AR14<='export html'!$AR$7),\"\",IF(AND(LEFT(AD14)=\"*\",RIGHT(AD14)=\"*\"),\"ff\",IF(CY14>CY29,\"t\",IF(CY14<CY29,\"u\",\"g\"))))","v":""},10]
[null,null,null,null,null,null,null,null,null,null,null,null,null,null,null,null,null,null,null,null,null,null,null,null,null,null,null,null,null,null,null,null,null,null,null,null,null,null,null,null,null,null,null,null,null,null,null,null,null,null,null,null,null,null,null,null,null,null,null,null,null,null,null,null,null,null,null,null,null,null,null,null,null,11,{"$f":"IF(OR(ISERROR(FIND(\"-\",Q15)),AE15>'export html'!$AR$7),\"\",IF(AND(LEFT(Q15)=\"*\",RIGHT(Q15)=\"*\"),\"ff\",IF(BW15>BW30,\"t\",IF(BW15<BW30,\"u\",\"g\"))))","v":""},{"$f":"IF(OR(ISERROR(FIND(\"-\",R15)),AF15>'export html'!$AR$7),\"\",IF(AND(LEFT(R15)=\"*\",RIGHT(R15)=\"*\"),\"ff\",IF(BX15>BX30,\"t\",IF(BX15<BX30,\"u\",\"g\"))))","v":""},{"$f":"IF(OR(ISERROR(FIND(\"-\",S15)),AG15>'export html'!$AR$7),\"\",IF(AND(LEFT(S15)=\"*\",RIGHT(S15)=\"*\"),\"ff\",IF(BY15>BY30,\"t\",IF(BY15<BY30,\"u\",\"g\"))))","v":"t"},{"$f":"IF(OR(ISERROR(FIND(\"-\",T15)),AH15>'export html'!$AR$7),\"\",IF(AND(LEFT(T15)=\"*\",RIGHT(T15)=\"*\"),\"ff\",IF(BZ15>BZ30,\"t\",IF(BZ15<BZ30,\"u\",\"g\"))))","v":"u"},{"$f":"IF(OR(ISERROR(FIND(\"-\",U15)),AI15>'export html'!$AR$7),\"\",IF(AND(LEFT(U15)=\"*\",RIGHT(U15)=\"*\"),\"ff\",IF(CA15>CA30,\"t\",IF(CA15<CA30,\"u\",\"g\"))))","v":""},{"$f":"IF(OR(ISERROR(FIND(\"-\",V15)),AJ15>'export html'!$AR$7),\"\",IF(AND(LEFT(V15)=\"*\",RIGHT(V15)=\"*\"),\"ff\",IF(CB15>CB30,\"t\",IF(CB15<CB30,\"u\",\"g\"))))","v":""},{"$f":"IF(OR(ISERROR(FIND(\"-\",W15)),AK15>'export html'!$AR$7),\"\",IF(AND(LEFT(W15)=\"*\",RIGHT(W15)=\"*\"),\"ff\",IF(CC15>CC30,\"t\",IF(CC15<CC30,\"u\",\"g\"))))","v":""},{"$f":"IF(OR(ISERROR(FIND(\"-\",X15)),AL15>'export html'!$AR$7),\"\",IF(AND(LEFT(X15)=\"*\",RIGHT(X15)=\"*\"),\"ff\",IF(CD15>CD30,\"t\",IF(CD15<CD30,\"u\",\"g\"))))","v":""},{"$f":"IF(OR(ISERROR(FIND(\"-\",Y15)),AM15>'export html'!$AR$7),\"\",IF(AND(LEFT(Y15)=\"*\",RIGHT(Y15)=\"*\"),\"ff\",IF(CE15>CE30,\"t\",IF(CE15<CE30,\"u\",\"g\"))))","v":"t"},{"$f":"IF(OR(ISERROR(FIND(\"-\",Z15)),AN15>'export html'!$AR$7),\"\",IF(AND(LEFT(Z15)=\"*\",RIGHT(Z15)=\"*\"),\"ff\",IF(CF15>CF30,\"t\",IF(CF15<CF30,\"u\",\"g\"))))","v":""},null,{"$f":"IF(OR(ISERROR(FIND(\"-\",AB15)),AP15>'export html'!$AR$7),\"\",IF(AND(LEFT(AB15)=\"*\",RIGHT(AB15)=\"*\"),\"ff\",IF(CH15>CH30,\"t\",IF(CH15<CH30,\"u\",\"g\"))))","v":""},{"$f":"IF(OR(ISERROR(FIND(\"-\",AC15)),AQ15>'export html'!$AR$7),\"\",IF(AND(LEFT(AC15)=\"*\",RIGHT(AC15)=\"*\"),\"ff\",IF(CI15>CI30,\"t\",IF(CI15<CI30,\"u\",\"g\"))))","v":""},{"$f":"IF(OR(ISERROR(FIND(\"-\",AD15)),AR15>'export html'!$AR$7),\"\",IF(AND(LEFT(AD15)=\"*\",RIGHT(AD15)=\"*\"),\"ff\",IF(CJ15>CJ30,\"t\",IF(CJ15<CJ30,\"u\",\"g\"))))","v":""},11,{"$f":"IF(OR(ISERROR(FIND(\"-\",Q15)),AE15<='export html'!$AR$7),\"\",IF(AND(LEFT(Q15)=\"*\",RIGHT(Q15)=\"*\"),\"ff\",IF(CL15>CL30,\"t\",IF(CL15<CL30,\"u\",\"g\"))))","v":""},{"$f":"IF(OR(ISERROR(FIND(\"-\",R15)),AF15<='export html'!$AR$7),\"\",IF(AND(LEFT(R15)=\"*\",RIGHT(R15)=\"*\"),\"ff\",IF(CM15>CM30,\"t\",IF(CM15<CM30,\"u\",\"g\"))))","v":""},{"$f":"IF(OR(ISERROR(FIND(\"-\",S15)),AG15<='export html'!$AR$7),\"\",IF(AND(LEFT(S15)=\"*\",RIGHT(S15)=\"*\"),\"ff\",IF(CN15>CN30,\"t\",IF(CN15<CN30,\"u\",\"g\"))))","v":""},{"$f":"IF(OR(ISERROR(FIND(\"-\",T15)),AH15<='export html'!$AR$7),\"\",IF(AND(LEFT(T15)=\"*\",RIGHT(T15)=\"*\"),\"ff\",IF(CO15>CO30,\"t\",IF(CO15<CO30,\"u\",\"g\"))))","v":""},{"$f":"IF(OR(ISERROR(FIND(\"-\",U15)),AI15<='export html'!$AR$7),\"\",IF(AND(LEFT(U15)=\"*\",RIGHT(U15)=\"*\"),\"ff\",IF(CP15>CP30,\"t\",IF(CP15<CP30,\"u\",\"g\"))))","v":""},{"$f":"IF(OR(ISERROR(FIND(\"-\",V15)),AJ15<='export html'!$AR$7),\"\",IF(AND(LEFT(V15)=\"*\",RIGHT(V15)=\"*\"),\"ff\",IF(CQ15>CQ30,\"t\",IF(CQ15<CQ30,\"u\",\"g\"))))","v":""},{"$f":"IF(OR(ISERROR(FIND(\"-\",W15)),AK15<='export html'!$AR$7),\"\",IF(AND(LEFT(W15)=\"*\",RIGHT(W15)=\"*\"),\"ff\",IF(CR15>CR30,\"t\",IF(CR15<CR30,\"u\",\"g\"))))","v":""},{"$f":"IF(OR(ISERROR(FIND(\"-\",X15)),AL15<='export html'!$AR$7),\"\",IF(AND(LEFT(X15)=\"*\",RIGHT(X15)=\"*\"),\"ff\",IF(CS15>CS30,\"t\",IF(CS15<CS30,\"u\",\"g\"))))","v":""},{"$f":"IF(OR(ISERROR(FIND(\"-\",Y15)),AM15<='export html'!$AR$7),\"\",IF(AND(LEFT(Y15)=\"*\",RIGHT(Y15)=\"*\"),\"ff\",IF(CT15>CT30,\"t\",IF(CT15<CT30,\"u\",\"g\"))))","v":""},{"$f":"IF(OR(ISERROR(FIND(\"-\",Z15)),AN15<='export html'!$AR$7),\"\",IF(AND(LEFT(Z15)=\"*\",RIGHT(Z15)=\"*\"),\"ff\",IF(CU15>CU30,\"t\",IF(CU15<CU30,\"u\",\"g\"))))","v":""},null,{"$f":"IF(OR(ISERROR(FIND(\"-\",AB15)),AP15<='export html'!$AR$7),\"\",IF(AND(LEFT(AB15)=\"*\",RIGHT(AB15)=\"*\"),\"ff\",IF(CW15>CW30,\"t\",IF(CW15<CW30,\"u\",\"g\"))))","v":""},{"$f":"IF(OR(ISERROR(FIND(\"-\",AC15)),AQ15<='export html'!$AR$7),\"\",IF(AND(LEFT(AC15)=\"*\",RIGHT(AC15)=\"*\"),\"ff\",IF(CX15>CX30,\"t\",IF(CX15<CX30,\"u\",\"g\"))))","v":""},{"$f":"IF(OR(ISERROR(FIND(\"-\",AD15)),AR15<='export html'!$AR$7),\"\",IF(AND(LEFT(AD15)=\"*\",RIGHT(AD15)=\"*\"),\"ff\",IF(CY15>CY30,\"t\",IF(CY15<CY30,\"u\",\"g\"))))","v":""},11]
[null,null,null,null,null,null,null,null,null,null,null,null,null,null,null,null,null,null,null,null,null,null,null,null,null,null,null,null,null,null,null,null,null,null,null,null,null,null,null,null,null,null,null,null,null,null,null,null,null,null,null,null,null,null,null,null,null,null,null,null,null,null,null,null,null,null,null,null,null,null,null,null,null,12,{"$f":"IF(OR(ISERROR(FIND(\"-\",Q16)),AE16>'export html'!$AR$7),\"\",IF(AND(LEFT(Q16)=\"*\",RIGHT(Q16)=\"*\"),\"ff\",IF(BW16>BW31,\"t\",IF(BW16<BW31,\"u\",\"g\"))))","v":""},{"$f":"IF(OR(ISERROR(FIND(\"-\",R16)),AF16>'export html'!$AR$7),\"\",IF(AND(LEFT(R16)=\"*\",RIGHT(R16)=\"*\"),\"ff\",IF(BX16>BX31,\"t\",IF(BX16<BX31,\"u\",\"g\"))))","v":""},{"$f":"IF(OR(ISERROR(FIND(\"-\",S16)),AG16>'export html'!$AR$7),\"\",IF(AND(LEFT(S16)=\"*\",RIGHT(S16)=\"*\"),\"ff\",IF(BY16>BY31,\"t\",IF(BY16<BY31,\"u\",\"g\"))))","v":""},{"$f":"IF(OR(ISERROR(FIND(\"-\",T16)),AH16>'export html'!$AR$7),\"\",IF(AND(LEFT(T16)=\"*\",RIGHT(T16)=\"*\"),\"ff\",IF(BZ16>BZ31,\"t\",IF(BZ16<BZ31,\"u\",\"g\"))))","v":""},{"$f":"IF(OR(ISERROR(FIND(\"-\",U16)),AI16>'export html'!$AR$7),\"\",IF(AND(LEFT(U16)=\"*\",RIGHT(U16)=\"*\"),\"ff\",IF(CA16>CA31,\"t\",IF(CA16<CA31,\"u\",\"g\"))))","v":""},{"$f":"IF(OR(ISERROR(FIND(\"-\",V16)),AJ16>'export html'!$AR$7),\"\",IF(AND(LEFT(V16)=\"*\",RIGHT(V16)=\"*\"),\"ff\",IF(CB16>CB31,\"t\",IF(CB16<CB31,\"u\",\"g\"))))","v":"u"},{"$f":"IF(OR(ISERROR(FIND(\"-\",W16)),AK16>'export html'!$AR$7),\"\",IF(AND(LEFT(W16)=\"*\",RIGHT(W16)=\"*\"),\"ff\",IF(CC16>CC31,\"t\",IF(CC16<CC31,\"u\",\"g\"))))","v":"t"},{"$f":"IF(OR(ISERROR(FIND(\"-\",X16)),AL16>'export html'!$AR$7),\"\",IF(AND(LEFT(X16)=\"*\",RIGHT(X16)=\"*\"),\"ff\",IF(CD16>CD31,\"t\",IF(CD16<CD31,\"u\",\"g\"))))","v":""},{"$f":"IF(OR(ISERROR(FIND(\"-\",Y16)),AM16>'export html'!$AR$7),\"\",IF(AND(LEFT(Y16)=\"*\",RIGHT(Y16)=\"*\"),\"ff\",IF(CE16>CE31,\"t\",IF(CE16<CE31,\"u\",\"g\"))))","v":""},{"$f":"IF(OR(ISERROR(FIND(\"-\",Z16)),AN16>'export html'!$AR$7),\"\",IF(AND(LEFT(Z16)=\"*\",RIGHT(Z16)=\"*\"),\"ff\",IF(CF16>CF31,\"t\",IF(CF16<CF31,\"u\",\"g\"))))","v":""},{"$f":"IF(OR(ISERROR(FIND(\"-\",AA16)),AO16>'export html'!$AR$7),\"\",IF(AND(LEFT(AA16)=\"*\",RIGHT(AA16)=\"*\"),\"ff\",IF(CG16>CG31,\"t\",IF(CG16<CG31,\"u\",\"g\"))))","v":""},null,{"$f":"IF(OR(ISERROR(FIND(\"-\",AC16)),AQ16>'export html'!$AR$7),\"\",IF(AND(LEFT(AC16)=\"*\",RIGHT(AC16)=\"*\"),\"ff\",IF(CI16>CI31,\"t\",IF(CI16<CI31,\"u\",\"g\"))))","v":"t"},{"$f":"IF(OR(ISERROR(FIND(\"-\",AD16)),AR16>'export html'!$AR$7),\"\",IF(AND(LEFT(AD16)=\"*\",RIGHT(AD16)=\"*\"),\"ff\",IF(CJ16>CJ31,\"t\",IF(CJ16<CJ31,\"u\",\"g\"))))","v":""},12,{"$f":"IF(OR(ISERROR(FIND(\"-\",Q16)),AE16<='export html'!$AR$7),\"\",IF(AND(LEFT(Q16)=\"*\",RIGHT(Q16)=\"*\"),\"ff\",IF(CL16>CL31,\"t\",IF(CL16<CL31,\"u\",\"g\"))))","v":""},{"$f":"IF(OR(ISERROR(FIND(\"-\",R16)),AF16<='export html'!$AR$7),\"\",IF(AND(LEFT(R16)=\"*\",RIGHT(R16)=\"*\"),\"ff\",IF(CM16>CM31,\"t\",IF(CM16<CM31,\"u\",\"g\"))))","v":""},{"$f":"IF(OR(ISERROR(FIND(\"-\",S16)),AG16<='export html'!$AR$7),\"\",IF(AND(LEFT(S16)=\"*\",RIGHT(S16)=\"*\"),\"ff\",IF(CN16>CN31,\"t\",IF(CN16<CN31,\"u\",\"g\"))))","v":""},{"$f":"IF(OR(ISERROR(FIND(\"-\",T16)),AH16<='export html'!$AR$7),\"\",IF(AND(LEFT(T16)=\"*\",RIGHT(T16)=\"*\"),\"ff\",IF(CO16>CO31,\"t\",IF(CO16<CO31,\"u\",\"g\"))))","v":""},{"$f":"IF(OR(ISERROR(FIND(\"-\",U16)),AI16<='export html'!$AR$7),\"\",IF(AND(LEFT(U16)=\"*\",RIGHT(U16)=\"*\"),\"ff\",IF(CP16>CP31,\"t\",IF(CP16<CP31,\"u\",\"g\"))))","v":""},{"$f":"IF(OR(ISERROR(FIND(\"-\",V16)),AJ16<='export html'!$AR$7),\"\",IF(AND(LEFT(V16)=\"*\",RIGHT(V16)=\"*\"),\"ff\",IF(CQ16>CQ31,\"t\",IF(CQ16<CQ31,\"u\",\"g\"))))","v":""},{"$f":"IF(OR(ISERROR(FIND(\"-\",W16)),AK16<='export html'!$AR$7),\"\",IF(AND(LEFT(W16)=\"*\",RIGHT(W16)=\"*\"),\"ff\",IF(CR16>CR31,\"t\",IF(CR16<CR31,\"u\",\"g\"))))","v":""},{"$f":"IF(OR(ISERROR(FIND(\"-\",X16)),AL16<='export html'!$AR$7),\"\",IF(AND(LEFT(X16)=\"*\",RIGHT(X16)=\"*\"),\"ff\",IF(CS16>CS31,\"t\",IF(CS16<CS31,\"u\",\"g\"))))","v":""},{"$f":"IF(OR(ISERROR(FIND(\"-\",Y16)),AM16<='export html'!$AR$7),\"\",IF(AND(LEFT(Y16)=\"*\",RIGHT(Y16)=\"*\"),\"ff\",IF(CT16>CT31,\"t\",IF(CT16<CT31,\"u\",\"g\"))))","v":""},{"$f":"IF(OR(ISERROR(FIND(\"-\",Z16)),AN16<='export html'!$AR$7),\"\",IF(AND(LEFT(Z16)=\"*\",RIGHT(Z16)=\"*\"),\"ff\",IF(CU16>CU31,\"t\",IF(CU16<CU31,\"u\",\"g\"))))","v":""},{"$f":"IF(OR(ISERROR(FIND(\"-\",AA16)),AO16<='export html'!$AR$7),\"\",IF(AND(LEFT(AA16)=\"*\",RIGHT(AA16)=\"*\"),\"ff\",IF(CV16>CV31,\"t\",IF(CV16<CV31,\"u\",\"g\"))))","v":""},null,{"$f":"IF(OR(ISERROR(FIND(\"-\",AC16)),AQ16<='export html'!$AR$7),\"\",IF(AND(LEFT(AC16)=\"*\",RIGHT(AC16)=\"*\"),\"ff\",IF(CX16>CX31,\"t\",IF(CX16<CX31,\"u\",\"g\"))))","v":""},{"$f":"IF(OR(ISERROR(FIND(\"-\",AD16)),AR16<='export html'!$AR$7),\"\",IF(AND(LEFT(AD16)=\"*\",RIGHT(AD16)=\"*\"),\"ff\",IF(CY16>CY31,\"t\",IF(CY16<CY31,\"u\",\"g\"))))","v":""},12]
[null,null,null,null,null,null,null,null,null,null,null,null,null,null,null,null,null,null,null,null,null,null,null,null,null,null,null,null,null,null,null,null,null,null,null,null,null,null,null,null,null,null,null,null,null,null,null,null,null,null,null,null,null,null,null,null,null,null,null,null,null,null,null,null,null,null,null,null,null,null,null,null,null,13,{"$f":"IF(OR(ISERROR(FIND(\"-\",Q17)),AE17>'export html'!$AR$7),\"\",IF(AND(LEFT(Q17)=\"*\",RIGHT(Q17)=\"*\"),\"ff\",IF(BW17>BW32,\"t\",IF(BW17<BW32,\"u\",\"g\"))))","v":""},{"$f":"IF(OR(ISERROR(FIND(\"-\",R17)),AF17>'export html'!$AR$7),\"\",IF(AND(LEFT(R17)=\"*\",RIGHT(R17)=\"*\"),\"ff\",IF(BX17>BX32,\"t\",IF(BX17<BX32,\"u\",\"g\"))))","v":""},{"$f":"IF(OR(ISERROR(FIND(\"-\",S17)),AG17>'export html'!$AR$7),\"\",IF(AND(LEFT(S17)=\"*\",RIGHT(S17)=\"*\"),\"ff\",IF(BY17>BY32,\"t\",IF(BY17<BY32,\"u\",\"g\"))))","v":""},{"$f":"IF(OR(ISERROR(FIND(\"-\",T17)),AH17>'export html'!$AR$7),\"\",IF(AND(LEFT(T17)=\"*\",RIGHT(T17)=\"*\"),\"ff\",IF(BZ17>BZ32,\"t\",IF(BZ17<BZ32,\"u\",\"g\"))))","v":"g"},{"$f":"IF(OR(ISERROR(FIND(\"-\",U17)),AI17>'export html'!$AR$7),\"\",IF(AND(LEFT(U17)=\"*\",RIGHT(U17)=\"*\"),\"ff\",IF(CA17>CA32,\"t\",IF(CA17<CA32,\"u\",\"g\"))))","v":"g"},{"$f":"IF(OR(ISERROR(FIND(\"-\",V17)),AJ17>'export html'!$AR$7),\"\",IF(AND(LEFT(V17)=\"*\",RIGHT(V17)=\"*\"),\"ff\",IF(CB17>CB32,\"t\",IF(CB17<CB32,\"u\",\"g\"))))","v":""},{"$f":"IF(OR(ISERROR(FIND(\"-\",W17)),AK17>'export html'!$AR$7),\"\",IF(AND(LEFT(W17)=\"*\",RIGHT(W17)=\"*\"),\"ff\",IF(CC17>CC32,\"t\",IF(CC17<CC32,\"u\",\"g\"))))","v":""},{"$f":"IF(OR(ISERROR(FIND(\"-\",X17)),AL17>'export html'!$AR$7),\"\",IF(AND(LEFT(X17)=\"*\",RIGHT(X17)=\"*\"),\"ff\",IF(CD17>CD32,\"t\",IF(CD17<CD32,\"u\",\"g\"))))","v":""},{"$f":"IF(OR(ISERROR(FIND(\"-\",Y17)),AM17>'export html'!$AR$7),\"\",IF(AND(LEFT(Y17)=\"*\",RIGHT(Y17)=\"*\"),\"ff\",IF(CE17>CE32,\"t\",IF(CE17<CE32,\"u\",\"g\"))))","v":""},{"$f":"IF(OR(ISERROR(FIND(\"-\",Z17)),AN17>'export html'!$AR$7),\"\",IF(AND(LEFT(Z17)=\"*\",RIGHT(Z17)=\"*\"),\"ff\",IF(CF17>CF32,\"t\",IF(CF17<CF32,\"u\",\"g\"))))","v":"t"},{"$f":"IF(OR(ISERROR(FIND(\"-\",AA17)),AO17>'export html'!$AR$7),\"\",IF(AND(LEFT(AA17)=\"*\",RIGHT(AA17)=\"*\"),\"ff\",IF(CG17>CG32,\"t\",IF(CG17<CG32,\"u\",\"g\"))))","v":""},{"$f":"IF(OR(ISERROR(FIND(\"-\",AB17)),AP17>'export html'!$AR$7),\"\",IF(AND(LEFT(AB17)=\"*\",RIGHT(AB17)=\"*\"),\"ff\",IF(CH17>CH32,\"t\",IF(CH17<CH32,\"u\",\"g\"))))","v":""},null,{"$f":"IF(OR(ISERROR(FIND(\"-\",AD17)),AR17>'export html'!$AR$7),\"\",IF(AND(LEFT(AD17)=\"*\",RIGHT(AD17)=\"*\"),\"ff\",IF(CJ17>CJ32,\"t\",IF(CJ17<CJ32,\"u\",\"g\"))))","v":""},13,{"$f":"IF(OR(ISERROR(FIND(\"-\",Q17)),AE17<='export html'!$AR$7),\"\",IF(AND(LEFT(Q17)=\"*\",RIGHT(Q17)=\"*\"),\"ff\",IF(CL17>CL32,\"t\",IF(CL17<CL32,\"u\",\"g\"))))","v":""},{"$f":"IF(OR(ISERROR(FIND(\"-\",R17)),AF17<='export html'!$AR$7),\"\",IF(AND(LEFT(R17)=\"*\",RIGHT(R17)=\"*\"),\"ff\",IF(CM17>CM32,\"t\",IF(CM17<CM32,\"u\",\"g\"))))","v":""},{"$f":"IF(OR(ISERROR(FIND(\"-\",S17)),AG17<='export html'!$AR$7),\"\",IF(AND(LEFT(S17)=\"*\",RIGHT(S17)=\"*\"),\"ff\",IF(CN17>CN32,\"t\",IF(CN17<CN32,\"u\",\"g\"))))","v":""},{"$f":"IF(OR(ISERROR(FIND(\"-\",T17)),AH17<='export html'!$AR$7),\"\",IF(AND(LEFT(T17)=\"*\",RIGHT(T17)=\"*\"),\"ff\",IF(CO17>CO32,\"t\",IF(CO17<CO32,\"u\",\"g\"))))","v":""},{"$f":"IF(OR(ISERROR(FIND(\"-\",U17)),AI17<='export html'!$AR$7),\"\",IF(AND(LEFT(U17)=\"*\",RIGHT(U17)=\"*\"),\"ff\",IF(CP17>CP32,\"t\",IF(CP17<CP32,\"u\",\"g\"))))","v":""},{"$f":"IF(OR(ISERROR(FIND(\"-\",V17)),AJ17<='export html'!$AR$7),\"\",IF(AND(LEFT(V17)=\"*\",RIGHT(V17)=\"*\"),\"ff\",IF(CQ17>CQ32,\"t\",IF(CQ17<CQ32,\"u\",\"g\"))))","v":""},{"$f":"IF(OR(ISERROR(FIND(\"-\",W17)),AK17<='export html'!$AR$7),\"\",IF(AND(LEFT(W17)=\"*\",RIGHT(W17)=\"*\"),\"ff\",IF(CR17>CR32,\"t\",IF(CR17<CR32,\"u\",\"g\"))))","v":""},{"$f":"IF(OR(ISERROR(FIND(\"-\",X17)),AL17<='export html'!$AR$7),\"\",IF(AND(LEFT(X17)=\"*\",RIGHT(X17)=\"*\"),\"ff\",IF(CS17>CS32,\"t\",IF(CS17<CS32,\"u\",\"g\"))))","v":""},{"$f":"IF(OR(ISERROR(FIND(\"-\",Y17)),AM17<='export html'!$AR$7),\"\",IF(AND(LEFT(Y17)=\"*\",RIGHT(Y17)=\"*\"),\"ff\",IF(CT17>CT32,\"t\",IF(CT17<CT32,\"u\",\"g\"))))","v":""},{"$f":"IF(OR(ISERROR(FIND(\"-\",Z17)),AN17<='export html'!$AR$7),\"\",IF(AND(LEFT(Z17)=\"*\",RIGHT(Z17)=\"*\"),\"ff\",IF(CU17>CU32,\"t\",IF(CU17<CU32,\"u\",\"g\"))))","v":""},{"$f":"IF(OR(ISERROR(FIND(\"-\",AA17)),AO17<='export html'!$AR$7),\"\",IF(AND(LEFT(AA17)=\"*\",RIGHT(AA17)=\"*\"),\"ff\",IF(CV17>CV32,\"t\",IF(CV17<CV32,\"u\",\"g\"))))","v":""},{"$f":"IF(OR(ISERROR(FIND(\"-\",AB17)),AP17<='export html'!$AR$7),\"\",IF(AND(LEFT(AB17)=\"*\",RIGHT(AB17)=\"*\"),\"ff\",IF(CW17>CW32,\"t\",IF(CW17<CW32,\"u\",\"g\"))))","v":""},null,{"$f":"IF(OR(ISERROR(FIND(\"-\",AD17)),AR17<='export html'!$AR$7),\"\",IF(AND(LEFT(AD17)=\"*\",RIGHT(AD17)=\"*\"),\"ff\",IF(CY17>CY32,\"t\",IF(CY17<CY32,\"u\",\"g\"))))","v":""},13]
[null,null,null,null,null,null,null,null,null,null,null,null,null,null,null,null,null,null,null,null,null,null,null,null,null,null,null,null,null,null,null,null,null,null,null,null,null,null,null,null,null,null,null,null,null,null,null,null,null,null,null,null,null,null,null,null,null,null,null,null,null,null,null,null,null,null,null,null,null,null,null,null,null,14,{"$f":"IF(OR(ISERROR(FIND(\"-\",Q18)),AE18>'export html'!$AR$7),\"\",IF(AND(LEFT(Q18)=\"*\",RIGHT(Q18)=\"*\"),\"ff\",IF(BW18>BW33,\"t\",IF(BW18<BW33,\"u\",\"g\"))))","v":""},{"$f":"IF(OR(ISERROR(FIND(\"-\",R18)),AF18>'export html'!$AR$7),\"\",IF(AND(LEFT(R18)=\"*\",RIGHT(R18)=\"*\"),\"ff\",IF(BX18>BX33,\"t\",IF(BX18<BX33,\"u\",\"g\"))))","v":""},{"$f":"IF(OR(ISERROR(FIND(\"-\",S18)),AG18>'export html'!$AR$7),\"\",IF(AND(LEFT(S18)=\"*\",RIGHT(S18)=\"*\"),\"ff\",IF(BY18>BY33,\"t\",IF(BY18<BY33,\"u\",\"g\"))))","v":""},{"$f":"IF(OR(ISERROR(FIND(\"-\",T18)),AH18>'export html'!$AR$7),\"\",IF(AND(LEFT(T18)=\"*\",RIGHT(T18)=\"*\"),\"ff\",IF(BZ18>BZ33,\"t\",IF(BZ18<BZ33,\"u\",\"g\"))))","v":""},{"$f":"IF(OR(ISERROR(FIND(\"-\",U18)),AI18>'export html'!$AR$7),\"\",IF(AND(LEFT(U18)=\"*\",RIGHT(U18)=\"*\"),\"ff\",IF(CA18>CA33,\"t\",IF(CA18<CA33,\"u\",\"g\"))))","v":""},{"$f":"IF(OR(ISERROR(FIND(\"-\",V18)),AJ18>'export html'!$AR$7),\"\",IF(AND(LEFT(V18)=\"*\",RIGHT(V18)=\"*\"),\"ff\",IF(CB18>CB33,\"t\",IF(CB18<CB33,\"u\",\"g\"))))","v":""},{"$f":"IF(OR(ISERROR(FIND(\"-\",W18)),AK18>'export html'!$AR$7),\"\",IF(AND(LEFT(W18)=\"*\",RIGHT(W18)=\"*\"),\"ff\",IF(CC18>CC33,\"t\",IF(CC18<CC33,\"u\",\"g\"))))","v":"t"},{"$f":"IF(OR(ISERROR(FIND(\"-\",X18)),AL18>'export html'!$AR$7),\"\",IF(AND(LEFT(X18)=\"*\",RIGHT(X18)=\"*\"),\"ff\",IF(CD18>CD33,\"t\",IF(CD18<CD33,\"u\",\"g\"))))","v":""},{"$f":"IF(OR(ISERROR(FIND(\"-\",Y18)),AM18>'export html'!$AR$7),\"\",IF(AND(LEFT(Y18)=\"*\",RIGHT(Y18)=\"*\"),\"ff\",IF(CE18>CE33,\"t\",IF(CE18<CE33,\"u\",\"g\"))))","v":""},{"$f":"IF(OR(ISERROR(FIND(\"-\",Z18)),AN18>'export html'!$AR$7),\"\",IF(AND(LEFT(Z18)=\"*\",RIGHT(Z18)=\"*\"),\"ff\",IF(CF18>CF33,\"t\",IF(CF18<CF33,\"u\",\"g\"))))","v":""},{"$f":"IF(OR(ISERROR(FIND(\"-\",AA18)),AO18>'export html'!$AR$7),\"\",IF(AND(LEFT(AA18)=\"*\",RIGHT(AA18)=\"*\"),\"ff\",IF(CG18>CG33,\"t\",IF(CG18<CG33,\"u\",\"g\"))))","v":"t"},{"$f":"IF(OR(ISERROR(FIND(\"-\",AB18)),AP18>'export html'!$AR$7),\"\",IF(AND(LEFT(AB18)=\"*\",RIGHT(AB18)=\"*\"),\"ff\",IF(CH18>CH33,\"t\",IF(CH18<CH33,\"u\",\"g\"))))","v":""},{"$f":"IF(OR(ISERROR(FIND(\"-\",AC18)),AQ18>'export html'!$AR$7),\"\",IF(AND(LEFT(AC18)=\"*\",RIGHT(AC18)=\"*\"),\"ff\",IF(CI18>CI33,\"t\",IF(CI18<CI33,\"u\",\"g\"))))","v":"t"},null,14,{"$f":"IF(OR(ISERROR(FIND(\"-\",Q18)),AE18<='export html'!$AR$7),\"\",IF(AND(LEFT(Q18)=\"*\",RIGHT(Q18)=\"*\"),\"ff\",IF(CL18>CL33,\"t\",IF(CL18<CL33,\"u\",\"g\"))))","v":""},{"$f":"IF(OR(ISERROR(FIND(\"-\",R18)),AF18<='export html'!$AR$7),\"\",IF(AND(LEFT(R18)=\"*\",RIGHT(R18)=\"*\"),\"ff\",IF(CM18>CM33,\"t\",IF(CM18<CM33,\"u\",\"g\"))))","v":""},{"$f":"IF(OR(ISERROR(FIND(\"-\",S18)),AG18<='export html'!$AR$7),\"\",IF(AND(LEFT(S18)=\"*\",RIGHT(S18)=\"*\"),\"ff\",IF(CN18>CN33,\"t\",IF(CN18<CN33,\"u\",\"g\"))))","v":""},{"$f":"IF(OR(ISERROR(FIND(\"-\",T18)),AH18<='export html'!$AR$7),\"\",IF(AND(LEFT(T18)=\"*\",RIGHT(T18)=\"*\"),\"ff\",IF(CO18>CO33,\"t\",IF(CO18<CO33,\"u\",\"g\"))))","v":""},{"$f":"IF(OR(ISERROR(FIND(\"-\",U18)),AI18<='export html'!$AR$7),\"\",IF(AND(LEFT(U18)=\"*\",RIGHT(U18)=\"*\"),\"ff\",IF(CP18>CP33,\"t\",IF(CP18<CP33,\"u\",\"g\"))))","v":""},{"$f":"IF(OR(ISERROR(FIND(\"-\",V18)),AJ18<='export html'!$AR$7),\"\",IF(AND(LEFT(V18)=\"*\",RIGHT(V18)=\"*\"),\"ff\",IF(CQ18>CQ33,\"t\",IF(CQ18<CQ33,\"u\",\"g\"))))","v":""},{"$f":"IF(OR(ISERROR(FIND(\"-\",W18)),AK18<='export html'!$AR$7),\"\",IF(AND(LEFT(W18)=\"*\",RIGHT(W18)=\"*\"),\"ff\",IF(CR18>CR33,\"t\",IF(CR18<CR33,\"u\",\"g\"))))","v":""},{"$f":"IF(OR(ISERROR(FIND(\"-\",X18)),AL18<='export html'!$AR$7),\"\",IF(AND(LEFT(X18)=\"*\",RIGHT(X18)=\"*\"),\"ff\",IF(CS18>CS33,\"t\",IF(CS18<CS33,\"u\",\"g\"))))","v":""},{"$f":"IF(OR(ISERROR(FIND(\"-\",Y18)),AM18<='export html'!$AR$7),\"\",IF(AND(LEFT(Y18)=\"*\",RIGHT(Y18)=\"*\"),\"ff\",IF(CT18>CT33,\"t\",IF(CT18<CT33,\"u\",\"g\"))))","v":""},{"$f":"IF(OR(ISERROR(FIND(\"-\",Z18)),AN18<='export html'!$AR$7),\"\",IF(AND(LEFT(Z18)=\"*\",RIGHT(Z18)=\"*\"),\"ff\",IF(CU18>CU33,\"t\",IF(CU18<CU33,\"u\",\"g\"))))","v":""},{"$f":"IF(OR(ISERROR(FIND(\"-\",AA18)),AO18<='export html'!$AR$7),\"\",IF(AND(LEFT(AA18)=\"*\",RIGHT(AA18)=\"*\"),\"ff\",IF(CV18>CV33,\"t\",IF(CV18<CV33,\"u\",\"g\"))))","v":""},{"$f":"IF(OR(ISERROR(FIND(\"-\",AB18)),AP18<='export html'!$AR$7),\"\",IF(AND(LEFT(AB18)=\"*\",RIGHT(AB18)=\"*\"),\"ff\",IF(CW18>CW33,\"t\",IF(CW18<CW33,\"u\",\"g\"))))","v":""},{"$f":"IF(OR(ISERROR(FIND(\"-\",AC18)),AQ18<='export html'!$AR$7),\"\",IF(AND(LEFT(AC18)=\"*\",RIGHT(AC18)=\"*\"),\"ff\",IF(CX18>CX33,\"t\",IF(CX18<CX33,\"u\",\"g\"))))","v":""},null,14]
[null,null,null,null,null,null,null,null,null,null,null,null,null,null,null,null,null,null,null,null,null,null,null,null,null,null,null,null,null,null,null,null,null,null,null,null,null,null,null,null,null,null,null,null,null,null,null,null,null,null,null,null,null,null,null,null,null,null,null,null,null,null,null,null,null,null,null,null,null,null,null,null,null,null,1,2,3,4,5,6,7,8,9,10,11,12,13,14,null,1,2,3,4,5,6,7,8,9,10,11,12,13,14]

{"sheet":"kalender","index":1,"n_rows":39,"n_cols":7,"rows_kept":39,"cut":false,"hidden":false,"merged":[]}
[]
[null,"Spd.","Datum","Thuisploeg",null,"Uitploeg","Uitslag"]
["Competitie",{"$f":"IF(LEN('export html'!BF3),'export html'!BF3,\"\")","v":1},{"$f":"IF(LEN('export html'!BE3),'export html'!BE3,\"\")","v":"2024-09-01"},{"$f":"IF(LEN('export html'!BI3),'export html'!BI3,\"\")","v":"Lucyvo"},{"$f":"IF(LEN('export html'!BI3),\"-\",\"\")","v":"-"},{"$f":"IF(LEN('export html'!BJ3),'export html'!BJ3,\"\")","v":"Bar Patron"},{"$f":"IF(LEN('export html'!BH3),'export html'!BH3,\"\")","v":"2-4"}]
[null,{"$f":"IF(LEN('export html'!BF4),'export html'!BF4,\"\")","v":2},{"$f":"IF(LEN('export html'!BE4),'export html'!BE4,\"\")","v":"2024-09-08"},{"$f":"IF(LEN('export html'!BI4),'export html'!BI4,\"\")","v":"Goka"},{"$f":"IF(LEN('export html'!BI4),\"-\",\"\")","v":"-"},{"$f":"IF(LEN('export html'!BJ4),'export html'!BJ4,\"\")","v":"Lucyvo"},{"$f":"IF(LEN('export html'!BH4),'export html'!BH4,\"\")","v":"3-0"}]
[null,{"$f":"IF(LEN('export html'!BF5),'export html'!BF5,\"\")","v":3},{"$f":"IF(LEN('export html'!BE5),'export html'!BE5,\"\")","v":"2024-09-15"},{"$f":"IF(LEN('export html'!BI5),'export html'!BI5,\"\")","v":"Lucyvo"},{"$f":"IF(LEN('export html'!BI5),\"-\",\"\")","v":"-"},{"$f":"IF(LEN('export html'!BJ5),'export html'!BJ5,\"\")","v":"Alberta Schilde"},{"$f":"IF(LEN('export html'!BH5),'export html'!BH5,\"\")","v":"1-5"}]
[null,{"$f":"IF(LEN('export html'!BF6),'export html'!BF6,\"\")","v":4},{"$f":"IF(LEN('export html'!BE6),'export html'!BE6,\"\")","v":"2024-09-21"},{"$f":"IF(LEN('export html'!BI6),'export html'!BI6,\"\")","v":"SC Duffel"},{"$f":"IF(LEN('export html'!BI6),\"-\",\"\")","v":"-"},{"$f":"IF(LEN('export html'!BJ6),'export html'!BJ6,\"\")","v":"Lucyvo"},{"$f":"IF(LEN('export html'!BH6),'export html'!BH6,\"\")","v":"3-1"}]
[null,{"$f":"IF(LEN('export html'!BF7),'export html'!BF7,\"\")","v":5},{"$f":"IF(LEN('export html'!BE7),'export html'!BE7,\"\")","v":"2024-09-29"},{"$f":"IF(LEN('export html'!BI7),'export html'!BI7,\"\")","v":"Lucyvo"},{"$f":"IF(LEN('export html'!BI7),\"-\",\"\")","v":"-"},{"$f":"IF(LEN('export html'!BJ7),'export html'!BJ7,\"\")","v":"Hombeek"},{"$f":"IF(LEN('export html'!BH7),'export html'!BH7,\"\")","v":"5-1"}]
[null,{"$f":"IF(LEN('export html'!BF8),'export html'!BF8,\"\")","v":6},{"$f":"IF(LEN('export html'!BE8),'export html'!BE8,\"\")","v":"2024-10-06"},{"$f":"IF(LEN('export html'!BI8),'export html'!BI8,\"\")","v":"Daltons"},{"$f":"IF(LEN('export html'!BI8),\"-\",\"\")","v":"-"},{"$f":"IF(LEN('export html'!BJ8),'export html'!BJ8,\"\")","v":"Lucyvo"},{"$f":"IF(LEN('export html'!BH8),'export html'!BH8,\"\")","v":"3-0"}]
[null,{"$f":"IF(LEN('export html'!BF9),'export html'!BF9,\"\")","v":7},{"$f":"IF(LEN('export html'!BE9),'export html'!BE9,\"\")","v":"2024-10-13"},{"$f":"IF(LEN('export html'!BI9),'export html'!BI9,\"\")","v":"Lucyvo"},{"$f":"IF(LEN('export html'!BI9),\"-\",\"\")","v":"-"},{"$f":"IF(LEN('export html'!BJ9),'export html'!BJ9,\"\")","v":"Corum"},{"$f":"IF(LEN('export html'!BH9),'export html'!BH9,\"\")","v":""}]
[null,{"$f":"IF(LEN('export html'!BF10),'export html'!BF10,\"\")","v":8},{"$f":"IF(LEN('export html'!BE10),'export html'!BE10,\"\")","v":"2024-10-20"},{"$f":"IF(LEN('export html'!BI10),'export html'!BI10,\"\")","v":"Sint Anneke"},{"$f":"IF(LEN('export html'!BI10),\"-\",\"\")","v":"-"},{"$f":"IF(LEN('export html'!BJ10),'export html'!BJ10,\"\")","v":"Lucyvo"},{"$f":"IF(LEN('export html'!BH10),'export html'!BH10,\"\")","v":""}]
[null,{"$f":"IF(LEN('export html'!BF11),'export html'!BF11,\"\")","v":9},{"$f":"IF(LEN('export html'!BE11),'export html'!BE11,\"\")","v":"2024-11-03"},{"$f":"IF(LEN('export html'!BI11),'export html'!BI11,\"\")","v":"Jolika"},{"$f":"IF(LEN('export html'!BI11),\"-\",\"\")","v":"-"},{"$f":"IF(LEN('export html'!BJ11),'export html'!BJ11,\"\")","v":"Lucyvo"},{"$f":"IF(LEN('export html'!BH11),'export html'!BH11,\"\")","v":""}]
[null,{"$f":"IF(LEN('export html'!BF12),'export html'!BF12,\"\")","v":10},{"$f":"IF(LEN('export html'!BE12),'export html'!BE12,\"\")","v":"2024-11-10"},{"$f":"IF(LEN('export html'!BI12),'export html'!BI12,\"\")","v":"Lucyvo"},{"$f":"IF(LEN('export html'!BI12),\"-\",\"\")","v":"-"},{"$f":"IF(LEN('export html'!BJ12),'export html'!BJ12,\"\")","v":"Yerevan United"},{"$f":"IF(LEN('export html'!BH12),'export html'!BH12,\"\")","v":""}]
[null,{"$f":"IF(LEN('export html'!BF13),'export html'!BF13,\"\")","v":11},{"$f":"IF(LEN('export html'!BE13),'export html'!BE13,\"\")","v":"2024-11-17"},{"$f":"IF(LEN('export html'!BI13),'export html'!BI13,\"\")","v":"Bariton"},{"$f":"IF(LEN('export html'!BI13),\"-\",\"\")","v":"-"},{"$f":"IF(LEN('export html'!BJ13),'export html'!BJ13,\"\")","v":"Lucyvo"},{"$f":"IF(LEN('export html'!BH13),'export html'!BH13,\"\")","v":""}]
[null,{"$f":"IF(LEN('export html'!BF14),'export html'!BF14,\"\")","v":12},{"$f":"IF(LEN('export html'!BE14),'export html'!BE14,\"\")","v":"2024-11-24"},{"$f":"IF(LEN('export html'!BI14),'export html'!BI14,\"\")","v":"Lucyvo"},{"$f":"IF(LEN('export html'!BI14),\"-\",\"\")","v":"-"},{"$f":"IF(LEN('export html'!BJ14),'export html'!BJ14,\"\")","v":"Antwerp Global"},{"$f":"IF(LEN('export html'!BH14),'export html'!BH14,\"\")","v":""}]
[null,{"$f":"IF(LEN('export html'!BF15),'export html'!BF15,\"\")","v":13},{"$f":"IF(LEN('export html'!BE15),'export html'!BE15,\"\")","v":"2024-12-01"},{"$f":"IF(LEN('export html'!BI15),'export html'!BI15,\"\")","v":"Racing Emblem"},{"$f":"IF(LEN('export html'!BI15),\"-\",\"\")","v":"-"},{"$f":"IF(LEN('export html'!BJ15),'export html'!BJ15,\"\")","v":"Lucyvo"},{"$f":"IF(LEN('export html'!BH15),'export html'!BH15,\"\")","v":""}]
[null,{"$f":"IF(LEN('export html'!BF16),'export html'!BF16,\"\")","v":14},{"$f":"IF(LEN('export html'!BE16),'export html'!BE16,\"\")","v":"2024-12-08"},{"$f":"IF(LEN('export html'!BI16),'export html'!BI16,\"\")","v":"Bar Patron"},{"$f":"IF(LEN('export html'!BI16),\"-\",\"\")","v":"-"},{"$f":"IF(LEN('export html'!BJ16),'export html'!BJ16,\"\")","v":"Lucyvo"},{"$f":"IF(LEN('export html'!BH16),'export html'!BH16,\"\")","v":""}]
[null,{"$f":"IF(LEN('export html'!BF17),'export html'!BF17,\"\")","v":17},{"$f":"IF(LEN('export html'!BE17),'export html'!BE17,\"\")","v":"2024-12-22"},{"$f":"IF(LEN('export html'!BI17),'export html'!BI17,\"\")","v":"Lucyvo"},{"$f":"IF(LEN('export html'!BI17),\"-\",\"\")","v":"-"},{"$f":"IF(LEN('export html'!BJ17),'export html'!BJ17,\"\")","v":"SC Duffel"},{"$f":"IF(LEN('export html'!BH17),'export html'!BH17,\"\")","v":""}]
[null,{"$f":"IF(LEN('export html'!BF18),'export html'!BF18,\"\")","v":15},{"$f":"IF(LEN('export html'!BE18),'export html'!BE18,\"\")","v":"2025-01-12"},{"$f":"IF(LEN('export html'!BI18),'export html'!BI18,\"\")","v":"Lucyvo"},{"$f":"IF(LEN('export html'!BI18),\"-\",\"\")","v":"-"},{"$f":"IF(LEN('export html'!BJ18),'export html'!BJ18,\"\")","v":"Goka"},{"$f":"IF(LEN('export html'!BH18),'export html'!BH18,\"\")","v":""}]
[null,{"$f":"IF(LEN('export html'!BF19),'export html'!BF19,\"\")","v":16},{"$f":"IF(LEN('export html'!BE19),'export html'!BE19,\"\")","v":"2025-01-19"},{"$f":"IF(LEN('export html'!BI19),'export html'!BI19,\"\")","v":"Alberta Schilde"},{"$f":"IF(LEN('export html'!BI19),\"-\",\"\")","v":"-"},{"$f":"IF(LEN('export html'!BJ19),'export html'!BJ19,\"\")","v":"Lucyvo"},{"$f":"IF(LEN('export html'!BH19),'export html'!BH19,\"\")","v":""}]
[null,{"$f":"IF(LEN('export html'!BF20),'export html'!BF20,\"\")","v":18},{"$f":"IF(LEN('export html'!BE20),'export html'!BE20,\"\")","v":"2025-02-02"},{"$f":"IF(LEN('export html'!BI20),'export html'!BI20,\"\")","v":"Hombeek"},{"$f":"IF(LEN('export html'!BI20),\"-\",\"\")","v":"-"},{"$f":"IF(LEN('export html'!BJ20),'export html'!BJ20,\"\")","v":"Lucyvo"},{"$f":"IF(LEN('export html'!BH20),'export html'!BH20,\"\")","v":""}]
[null,{"$f":"IF(LEN('export html'!BF21),'export html'!BF21,\"\")","v":19},{"$f":"IF(LEN('export html'!BE21),'export html'!BE21,\"\")","v":"2025-02-09"},{"$f":"IF(LEN('export html'!BI21),'export html'!BI21,\"\")","v":"Lucyvo"},{"$f":"IF(LEN('export html'!BI21),\"-\",\"\")","v":"-"},{"$f":"IF(LEN('export html'!BJ21),'export html'!BJ21,\"\")","v":"Daltons"},{"$f":"IF(LEN('export html'!BH21),'export html'!BH21,\"\")","v":""}]
[null,{"$f":"IF(LEN('export html'!BF22),'export html'!BF22,\"\")","v":20},{"$f":"IF(LEN('export html'!BE22),'export html'!BE22,\"\")","v":"2025-02-16"},{"$f":"IF(LEN('export html'!BI22),'export html'!BI22,\"\")","v":"Corum"},{"$f":"IF(LEN('export html'!BI22),\"-\",\"\")","v":"-"},{"$f":"IF(LEN('export html'!BJ22),'export html'!BJ22,\"\")","v":"Lucyvo"},{"$f":"IF(LEN('export html'!BH22),'export html'!BH22,\"\")","v":""}]
[null,{"$f":"IF(LEN('export html'!BF23),'export html'!BF23,\"\")","v":21},{"$f":"IF(LEN('export html'!BE23),'export html'!BE23,\"\")","v":"2025-02-23"},{"$f":"IF(LEN('export html'!BI23),'export html'!BI23,\"\")","v":"Lucyvo"},{"$f":"IF(LEN('export html'!BI23),\"-\",\"\")","v":"-"},{"$f":"IF(LEN('export html'!BJ23),'export html'!BJ23,\"\")","v":"Sint Anneke"},{"$f":"IF(LEN('export html'!BH23),'export html'!BH23,\"\")","v":""}]
[null,{"$f":"IF(LEN('export html'!BF24),'export html'!BF24,\"\")","v":22},{"$f":"IF(LEN('export html'!BE24),'export html'!BE24,\"\")","v":"2025-03-09"},{"$f":"IF(LEN('export html'!BI24),'export html'!BI24,\"\")","v":"Lucyvo"},{"$f":"IF(LEN('export html'!BI24),\"-\",\"\")","v":"-"},{"$f":"IF(LEN('export html'!BJ24),'export html'!BJ24,\"\")","v":"Jolika"},{"$f":"IF(LEN('export html'!BH24),'export html'!BH24,\"\")","v":""}]
[null,{"$f":"IF(LEN('export html'!BF25),'export html'!BF25,\"\")","v":23},{"$f":"IF(LEN('export html'!BE25),'export html'!BE25,\"\")","v":"2025-03-16"},{"$f":"IF(LEN('export html'!BI25),'export html'!BI25,\"\")","v":"Yerevan United"},{"$f":"IF(LEN('export html'!BI25),\"-\",\"\")","v":"-"},{"$f":"IF(LEN('export html'!BJ25),'export html'!BJ25,\"\")","v":"Lucyvo"},{"$f":"IF(LEN('export html'!BH25),'export html'!BH25,\"\")","v":""}]
[null,{"$f":"IF(LEN('export html'!BF26),'export html'!BF26,\"\")","v":24},{"$f":"IF(LEN('export html'!BE26),'export html'!BE26,\"\")","v":"2025-03-23"},{"$f":"IF(LEN('export html'!BI26),'export html'!BI26,\"\")","v":"Lucyvo"},{"$f":"IF(LEN('export html'!BI26),\"-\",\"\")","v":"-"},{"$f":"IF(LEN('export html'!BJ26),'export html'!BJ26,\"\")","v":"Bariton"},{"$f":"IF(LEN('export html'!BH26),'export html'!BH26,\"\")","v":""}]
[null,{"$f":"IF(LEN('export html'!BF27),'export html'!BF27,\"\")","v":25},{"$f":"IF(LEN('export html'!BE27),'export html'!BE27,\"\")","v":"2025-03-30"},{"$f":"IF(LEN('export html'!BI27),'export html'!BI27,\"\")","v":"Antwerp Global"},{"$f":"IF(LEN('export html'!BI27),\"-\",\"\")","v":"-"},{"$f":"IF(LEN('export html'!BJ27),'export html'!BJ27,\"\")","v":"Lucyvo"},{"$f":"IF(LEN('export html'!BH27),'export html'!BH27,\"\")","v":""}]
[null,{"$f":"IF(LEN('export html'!BF28),'export html'!BF28,\"\")","v":26},{"$f":"IF(LEN('export html'!BE28),'export html'!BE28,\"\")","v":"2025-04-06"},{"$f":"IF(LEN('export html'!BI28),'export html'!BI28,\"\")","v":"Lucyvo"},{"$f":"IF(LEN('export html'!BI28),\"-\",\"\")","v":"-"},{"$f":"IF(LEN('export html'!BJ28),'export html'!BJ28,\"\")","v":"Racing Emblem"},{"$f":"IF(LEN('export html'!BH28),'export html'!BH28,\"\")","v":""}]
[null,{"$f":"IF(LEN('export html'!BF29),'export html'!BF29,\"\")","v":""},{"$f":"IF(LEN('export html'!BE29),'export html'!BE29,\"\")","v":""},{"$f":"IF(LEN('export html'!BI29),'export html'!BI29,\"\")","v":""},{"$f":"IF(LEN('export html'!BI29),\"-\",\"\")","v":""},{"$f":"IF(LEN('export html'!BJ29),'export html'!BJ29,\"\")","v":""},{"$f":"IF(LEN('export html'!BH29),'export html'!BH29,\"\")","v":""}]
[null,{"$f":"IF(LEN('export html'!BF30),'export html'!BF30,\"\")","v":""},{"$f":"IF(LEN('export html'!BE30),'export html'!BE30,\"\")","v":""},{"$f":"IF(LEN('export html'!BI30),'export html'!BI30,\"\")","v":""},{"$f":"IF(LEN('export html'!BI30),\"-\",\"\")","v":""},{"$f":"IF(LEN('export html'!BJ30),'export html'!BJ30,\"\")","v":""}]
[]
[]
[]
["Oefenmatchen",1,null,null,"-"]
[null,2,null,null,"-"]
[null,3,null,null,"-"]
[null,4,null,null,"-"]
[]
["Beker",1,null,null,"-"]

{"sheet":"export html","index":2,"n_rows":32,"n_cols":62,"rows_kept":32,"cut":false,"hidden":true,"merged":[]}
[{"$f":"MAX(1,COUNTA(A3:A20))","v":7},null,null,null,"hulp: thuis","hulp: uit","hulp: uitslag",null,{"$f":"MAX(1,COUNT(I3:I9))","v":7},null,null,null,"hulp: thuis","hulp: uit","hulp: uitslag",null,null,null,null,{"$f":"MAX(1,COUNT(T3:T20))","v":5},null,"Recentste duels op ","uitslag",null,null,{"$f":"ROWS(_xlfn.ANCHORARRAY( Z3) )","v":4},null,null,null,null,null,{"$f":"ROWS(_xlfn.ANCHORARRAY( AF3) )","v":5},null,"Hulp: # goals",null,{"$f":"MAX(1,COUNTA(AJ3:AJ20))","v":1},null,null,null,null,null,{"$f":"RANK(spelersstatistieken!AB5,INDIRECT(\"spelersstatistieken!$\" & $AR$8 & \"$5:$\" & $AR$8 & \"$\" & 5+$AR$6-1))+ROW()/10^4","v":7.0000999999999998},null,null,null,null,{"$f":"MAX(1,COUNTA(AU3:AU40))","v":1},null,null,null,null,null,null,null,null,null,{"$f":"MAX(1,COUNT(BE3:BE30))","v":26},null,null,null,"hulp: thuis","hulp: uit"]
["Datum","Speeldag",{"$f":"\"Matchen van \" & IF('rooster en stand'!$J$31=0,\"speeldag \" & 'rooster en stand'!$F$31,TEXT('rooster en stand'!$J$31,\"dd/mm/jjjj\"))","v":"Matchen van speeldag 6"},"Uitslag",null,null,null,null,"Datum","Speeldag",{"$f":"\"Matchen van \" & IF('rooster en stand'!$J$31=0,\"speeldag \" & 'rooster en stand'!$F$31+1,TEXT('rooster en stand'!$J$31+'rooster en stand'!$K$31,\"dd/mm/jjjj\"))","v":"Matchen van speeldag 7"},"Uitslag / Plaatsen",null,null,null,null,null,null,null,"Datum","Speeldag",{"$f":"V1 & TEXT('rooster en stand'!$F$21,\"dd/mm/yyyy\")","v":"Recentste duels op 08/10/2024"},null,null,null,"Top-5","Assists",null,null,null,null,"Top-5","Goals",null,null,"Ronde","Datum","Uur","Match","Uitslag",null,{"$f":"RANK(spelersstatistieken!AB6,INDIRECT(\"spelersstatistieken!$\" & $AR$8 & \"$5:$\" & $AR$8 & \"$\" & 5+$AR$6-1))+ROW()/10^4","v":7.0002000000000004},null,1,"berekening stand",null,"Jaar",{"$f":"\"Uit het verleden...\" & IF(COUNTA(#REF!)>0,\" (\" & AU1 & \"x)\",\"\")","v":"Uit het verleden... (1x)"},"Uitslag","Datum","Speeldag",null,null,null,null,null,"Datum","Speeldag","Kalender","Uitslag"]
["2024-10-05",6,"SC Duffel - Bariton",{"$f":"IF(G3=0,\"\",G3)","v":"1-1"},"SC Duffel","Bariton","1-1",null,"2024-10-13",7,"Bariton - Hombeek",{"$f":"IF( O3 <> \"\", O3, \"plaats \" & MATCH( M3, 'rooster en stand'!$D$5:$D$18, 0 ) & \" - plaats \" & MATCH( N3, 'rooster en stand'!$D$5:$D$18, 0 ) )","v":"plaats 9 - plaats 8"},"Bariton","Hombeek",null,null,null,null,null,"2024-10-06",6,"Daltons - Lucyvo","3-0",null,{"$f":"_xlfn.SEQUENCE(Z1)","v":1},{"$f":"_xlfn.ANCHORARRAY(spelersstatistieken!AK150)","v":"Glenn De Vinster"},2,null,null,null,{"$f":"_xlfn.SEQUENCE(AF1)","v":1},{"$f":"_xlfn.ANCHORARRAY(spelersstatistieken!AK100)","v":"Stijn Hofmans"},3,null,null,"Ronde 1",null,null,null,null,null,{"$f":"RANK(spelersstatistieken!AB7,INDIRECT(\"spelersstatistieken!$\" & $AR$8 & \"$5:$\" & $AR$8 & \"$\" & 5+$AR$6-1))+ROW()/10^4","v":7.0003000000000002},null,"2024-10-10","VO kleurtje speeldag",null,null,"Geen head-to-head met Corum",null,null,null,null,null,null,null,null,"2024-09-01",1,"Lucyvo - Bar Patron","2-4","Lucyvo","Bar Patron"]
["2024-10-06",6,"Alberta Schilde - Antwerp Global","2-0","Alberta Schilde","Antwerp Global","2-0",null,"2024-10-13",7,"Racing Emblem - Alberta Schilde",{"$f":"IF( O4 <> \"\", O4, \"plaats \" & MATCH( M4, 'rooster en stand'!$D$5:$D$18, 0 ) & \" - plaats \" & MATCH( N4, 'rooster en stand'!$D$5:$D$18, 0 ) )","v":"plaats 7 - plaats 3"},"Racing Emblem","Alberta Schilde",null,null,null,null,null,"2024-09-29",5,"Lucyvo - Hombeek","5-1",null,2,"Stijn Hofmans",2,null,null,null,2,"Jorn Verhellen",2,null,null,null,null,null,null,null,null,{"$f":"RANK(spelersstatistieken!AB8,INDIRECT(\"spelersstatistieken!$\" & $AR$8 & \"$5:$\" & $AR$8 & \"$\" & 5+$AR$6-1))+ROW()/10^4","v":3.0004},null,{"$f":"COUNTA( 'rooster en stand'!BI5:BI18 )","v":14},"aantal ploegen",null,null,null,null,null,null,null,null,null,null,null,"2024-09-08",2,"Goka - Lucyvo","3-0","Goka","Lucyvo"]
["2024-10-06",6,"Bar Patron - Jolika","6-0","Bar Patron","Jolika","6-0",null,"2024-10-13",7,"Antwerp Global - SC Duffel",{"$f":"IF( O5 <> \"\", O5, \"plaats \" & MATCH( M5, 'rooster en stand'!$D$5:$D$18, 0 ) & \" - plaats \" & MATCH( N5, 'rooster en stand'!$D$5:$D$18, 0 ) )","v":"plaats 5 - plaats 11"},"Antwerp Global","SC Duffel",null,null,null,null,null,"2024-09-21",4,"SC Duffel - Lucyvo","3-1",null,3,"Stijn Verdickt",2,null,null,null,3,"Wout Beirinckx",1,null,null,null,null,null,null,null,null,{"$f":"RANK(spelersstatistieken!AB9,INDIRECT(\"spelersstatistieken!$\" & $AR$8 & \"$5:$\" & $AR$8 & \"$\" & 5+$AR$6-1))+ROW()/10^4","v":7.0004999999999997},null,{"$f":"2 * ( AR4 - 1 )","v":26},"aantal matchen / ploeg",null,null,null,null,null,null,null,null,null,null,null,"2024-09-15",3,"Lucyvo - Alberta Schilde","1-5","Lucyvo","Alberta Schilde"]
["2024-10-06",6,"Corum - Sint Anneke","2-10","Corum","Sint Anneke","2-10",null,"2024-10-13",7,"Bar Patron - Goka",{"$f":"IF( O6 <> \"\", O6, \"plaats \" & MATCH( M6, 'rooster en stand'!$D$5:$D$18, 0 ) & \" - plaats \" & MATCH( N6, 'rooster en stand'!$D$5:$D$18, 0 ) )","v":"plaats 2 - plaats 10"},"Bar Patron","Goka",null,null,null,null,null,"2024-09-15",3,"Lucyvo - Alberta Schilde","1-5",null,4,"Kaïn Verlooy",1,null,null,null,4,"Maarten De Groof",1,null,null,null,null,null,null,null,null,{"$f":"RANK(spelersstatistieken!AB10,INDIRECT(\"spelersstatistieken!$\" & $AR$8 & \"$5:$\" & $AR$8 & \"$\" & 5+$AR$6-1))+ROW()/10^4","v":7.0006000000000004},null,32,"aantal spelers",null,null,null,null,null,null,null,null,null,null,null,"2024-09-21",4,"SC Duffel - Lucyvo","3-1","SC Duffel","Lucyvo"]
["2024-10-06",6,"Daltons - Lucyvo","3-0","Daltons","Lucyvo","3-0",null,"2024-10-13",7,"Jolika - Sint Anneke",{"$f":"IF( O7 <> \"\", O7, \"plaats \" & MATCH( M7, 'rooster en stand'!$D$5:$D$18, 0 ) & \" - plaats \" & MATCH( N7, 'rooster en stand'!$D$5:$D$18, 0 ) )","v":"plaats 14 - plaats 4"},"Jolika","Sint Anneke",null,null,null,null,null,"2024-09-08",2,"Goka - Lucyvo","3-0",null,null,null,null,null,null,null,5,"Glenn De Vinster",1,null,null,null,null,null,null,null,null,{"$f":"RANK(spelersstatistieken!AB11,INDIRECT(\"spelersstatistieken!$\" & $AR$8 & \"$5:$\" & $AR$8 & \"$\" & 5+$AR$6-1))+ROW()/10^4","v":7.0007000000000001},null,{"$f":"MatchenPerPloeg / 2 + ( ISODD( AR4 ))","v":13},"speeldagen in heenronde",null,null,null,null,null,null,null,null,null,null,null,"2024-09-29",5,"Lucyvo - Hombeek","5-1","Lucyvo","Hombeek"]
["2024-10-06",6,"Hombeek - Yerevan United",{"$f":"IF(G8=0,\"\",G8)","v":"1-1"},"Hombeek","Yerevan United","1-1",null,"2024-10-13",7,"Lucyvo - Corum",{"$f":"IF( O8 <> \"\", O8, \"plaats \" & MATCH( M8, 'rooster en stand'!$D$5:$D$18, 0 ) & \" - plaats \" & MATCH( N8, 'rooster en stand'!$D$5:$D$18, 0 ) )","v":"plaats 13 - plaats 12"},"Lucyvo","Corum",null,null,null,null,null,null,null,null,null,null,null,null,null,null,null,null,null,null,null,null,null,null,null,null,null,null,null,{"$f":"RANK(spelersstatistieken!AB12,INDIRECT(\"spelersstatistieken!$\" & $AR$8 & \"$5:$\" & $AR$8 & \"$\" & 5+$AR$6-1))+ROW()/10^4","v":7.0007999999999999},null,{"$f":"SUBSTITUTE( SUBSTITUTE( ADDRESS( 1, 1 + MatchenPerPloeg + 1 ), 1, \"\" ), \"$\", \"\" )","v":"AB"},"Kolom van de goal totalen",null,null,null,null,null,null,null,null,null,null,null,"2024-10-06",6,"Daltons - Lucyvo","3-0","Daltons","Lucyvo"]
["2024-10-06",6,"Goka - Racing Emblem","2-5","Goka","Racing Emblem","2-5",null,"2024-10-13",7,"Yerevan United - Daltons",{"$f":"IF( O9 <> \"\", O9, \"plaats \" & MATCH( M9, 'rooster en stand'!$D$5:$D$18, 0 ) & \" - plaats \" & MATCH( N9, 'rooster en stand'!$D$5:$D$18, 0 ) )","v":"plaats 6 - plaats 1"},"Yerevan United","Daltons",null,null,null,null,null,null,null,null,null,null,null,null,null,null,null,null,null,null,null,null,null,null,null,null,null,null,null,{"$f":"RANK(spelersstatistieken!AB13,INDIRECT(\"spelersstatistieken!$\" & $AR$8 & \"$5:$\" & $AR$8 & \"$\" & 5+$AR$6-1))+ROW()/10^4","v":7.0008999999999997},null,null,null,null,null,null,null,null,null,null,null,null,null,null,"2024-10-13",7,"Lucyvo - Corum",null,"Lucyvo","Corum"]
[null,null,null,null,null,null,null,null,null,null,null,null,null,null,null,null,null,null,null,null,null,null,null,null,null,null,null,null,null,null,null,null,null,null,null,null,null,null,null,null,null,{"$f":"RANK(spelersstatistieken!AB14,INDIRECT(\"spelersstatistieken!$\" & $AR$8 & \"$5:$\" & $AR$8 & \"$\" & 5+$AR$6-1))+ROW()/10^4","v":3.0009999999999999},null,null,null,null,null,null,null,null,null,null,null,null,null,null,"2024-10-20",8,"Sint Anneke - Lucyvo",null,"Sint Anneke","Lucyvo"]
[null,null,null,null,null,null,null,null,null,null,null,null,null,null,null,null,null,null,null,null,null,null,null,null,null,null,null,null,null,null,null,null,null,null,null,null,null,null,null,null,null,{"$f":"RANK(spelersstatistieken!AB15,INDIRECT(\"spelersstatistieken!$\" & $AR$8 & \"$5:$\" & $AR$8 & \"$\" & 5+$AR$6-1))+ROW()/10^4","v":7.0011000000000001},null,null,null,null,null,null,null,null,null,null,null,null,null,null,"2024-11-03",9,"Jolika - Lucyvo",null,"Jolika","Lucyvo"]
[null,null,null,null,null,null,null,null,null,null,null,null,null,null,null,null,null,null,null,null,null,null,null,null,null,null,null,null,null,null,null,null,null,null,null,null,null,null,null,null,null,{"$f":"RANK(spelersstatistieken!AB16,INDIRECT(\"spelersstatistieken!$\" & $AR$8 & \"$5:$\" & $AR$8 & \"$\" & 5+$AR$6-1))+ROW()/10^4","v":7.0011999999999999},null,null,null,null,null,null,null,null,null,null,null,null,null,null,"2024-11-10",10,"Lucyvo - Yerevan United",null,"Lucyvo","Yerevan United"]
[null,null,null,null,null,null,null,null,null,null,null,null,null,null,null,null,null,null,null,null,null,null,null,null,null,null,null,null,null,null,null,null,null,null,null,null,null,null,null,null,null,{"$f":"RANK(spelersstatistieken!AB17,INDIRECT(\"spelersstatistieken!$\" & $AR$8 & \"$5:$\" & $AR$8 & \"$\" & 5+$AR$6-1))+ROW()/10^4","v":3.0013000000000001},null,null,null,null,null,null,null,null,null,null,null,null,null,null,"2024-11-17",11,"Bariton - Lucyvo",null,"Bariton","Lucyvo"]
[null,null,null,null,null,null,null,null,null,null,null,null,null,null,null,null,null,null,null,null,null,null,null,null,null,null,null,null,null,null,null,null,null,null,null,null,null,null,null,null,null,{"$f":"RANK(spelersstatistieken!AB18,INDIRECT(\"spelersstatistieken!$\" & $AR$8 & \"$5:$\" & $AR$8 & \"$\" & 5+$AR$6-1))+ROW()/10^4","v":7.0014000000000003},null,null,null,null,null,null,null,null,null,null,null,null,null,null,"2024-11-24",12,"Lucyvo - Antwerp Global",null,"Lucyvo","Antwerp Global"]
[null,null,null,null,null,null,null,null,null,null,null,null,null,null,null,null,null,null,null,null,null,null,null,null,null,null,null,null,null,null,null,null,null,null,null,null,null,null,null,null,null,{"$f":"RANK(spelersstatistieken!AB19,INDIRECT(\"spelersstatistieken!$\" & $AR$8 & \"$5:$\" & $AR$8 & \"$\" & 5+$AR$6-1))+ROW()/10^4","v":7.0015000000000001},null,null,null,null,null,null,null,null,null,null,null,null,null,null,"2024-12-01",13,"Racing Emblem - Lucyvo",null,"Racing Emblem","Lucyvo"]
[null,null,null,null,null,null,null,null,null,null,null,null,null,null,null,null,null,null,null,null,null,null,null,null,null,null,null,null,null,null,null,null,null,null,null,null,null,null,null,null,null,{"$f":"RANK(spelersstatistieken!AB20,INDIRECT(\"spelersstatistieken!$\" & $AR$8 & \"$5:$\" & $AR$8 & \"$\" & 5+$AR$6-1))+ROW()/10^4","v":7.0015999999999998},null,null,null,null,null,null,null,null,null,null,null,null,null,null,"2024-12-08",14,"Bar Patron - Lucyvo",null,"Bar Patron","Lucyvo"]
[null,null,null,null,null,null,null,null,null,null,null,null,null,null,null,null,null,null,null,null,null,null,null,null,null,null,null,null,null,null,null,null,null,null,null,null,null,null,null,null,null,{"$f":"RANK(spelersstatistieken!AB21,INDIRECT(\"spelersstatistieken!$\" & $AR$8 & \"$5:$\" & $AR$8 & \"$\" & 5+$AR$6-1))+ROW()/10^4","v":7.0016999999999996},null,"=IF( O4 <> \"\"; O4; \"Pl. 4 - pl. 5\" )",null,null,null,null,null,null,null,null,null,null,null,null,"2024-12-22",17,"Lucyvo - SC Duffel",null,"Lucyvo","SC Duffel"]
[null,null,null,null,null,null,null,null,null,null,null,null,null,null,null,null,null,null,null,null,null,null,null,null,null,null,null,null,null,null,null,null,null,null,null,null,null,null,null,null,null,{"$f":"RANK(spelersstatistieken!AB22,INDIRECT(\"spelersstatistieken!$\" & $AR$8 & \"$5:$\" & $AR$8 & \"$\" & 5+$AR$6-1))+ROW()/10^4","v":1.0018},null,null,null,null,null,null,null,null,null,null,null,null,null,null,"2025-01-12",15,"Lucyvo - Goka",null,"Lucyvo","Goka"]
[null,null,null,null,null,null,null,null,null,null,null,null,null,null,null,null,null,null,null,null,null,null,null,null,null,null,null,null,null,null,null,null,null,null,null,null,null,null,null,null,null,{"$f":"RANK(spelersstatistieken!AB23,INDIRECT(\"spelersstatistieken!$\" & $AR$8 & \"$5:$\" & $AR$8 & \"$\" & 5+$AR$6-1))+ROW()/10^4","v":7.0019},null,null,null,null,null,null,null,null,null,null,null,null,null,null,"2025-01-19",16,"Alberta Schilde - Lucyvo",null,"Alberta Schilde","Lucyvo"]
[null,null,null,null,null,null,null,null,null,null,null,null,null,null,null,null,null,null,null,null,null,null,null,null,null,null,null,null,null,null,null,null,null,null,null,null,null,null,null,null,null,{"$f":"RANK(spelersstatistieken!AB24,INDIRECT(\"spelersstatistieken!$\" & $AR$8 & \"$5:$\" & $AR$8 & \"$\" & 5+$AR$6-1))+ROW()/10^4","v":7.0019999999999998},null,null,null,null,null,null,null,null,null,null,null,null,null,null,"2025-02-02",18,"Hombeek - Lucyvo",null,"Hombeek","Lucyvo"]
[null,null,null,null,null,null,null,null,null,null,null,null,null,null,null,null,null,null,null,null,null,null,null,null,null,null,null,null,null,null,null,null,null,null,null,null,null,null,null,null,null,{"$f":"RANK(spelersstatistieken!AB25,INDIRECT(\"spelersstatistieken!$\" & $AR$8 & \"$5:$\" & $AR$8 & \"$\" & 5+$AR$6-1))+ROW()/10^4","v":7.0021000000000004},null,null,null,null,null,null,null,null,null,null,null,null,null,null,"2025-02-09",19,"Lucyvo - Daltons",null,"Lucyvo","Daltons"]
[null,null,null,null,null,null,null,null,null,null,null,null,null,null,null,null,null,null,null,null,null,null,null,null,null,null,null,null,null,null,null,null,null,null,null,null,null,null,null,null,null,{"$f":"RANK(spelersstatistieken!AB26,INDIRECT(\"spelersstatistieken!$\" & $AR$8 & \"$5:$\" & $AR$8 & \"$\" & 5+$AR$6-1))+ROW()/10^4","v":7.0022000000000002},null,null,null,null,null,null,null,null,null,null,null,null,null,null,"2025-02-16",20,"Corum - Lucyvo",null,"Corum","Lucyvo"]
[null,null,null,null,null,null,null,null,null,null,null,null,null,null,null,null,null,null,null,null,null,null,null,null,null,null,null,null,null,null,null,"#IF(OR($AE3#0;$AG3#\"\");\"(Niemand)\";OFFSET(spelersstatistieken!$A$4;MATCH(SMALL(coeffsspelers;AE3);coeffsspelers;0);0))","#IF($AE3#0;\"\";IF(AH3#0;\"\";AH3))","#OFFSET(spelersstatistieken!$A$4;MATCH(SMALL(coeffsspelers;AE3);coeffsspelers;0);MatchenPerPloeg+1)",null,null,null,null,null,null,null,{"$f":"RANK(spelersstatistieken!AB27,INDIRECT(\"spelersstatistieken!$\" & $AR$8 & \"$5:$\" & $AR$8 & \"$\" & 5+$AR$6-1))+ROW()/10^4","v":7.0023},null,null,null,null,null,null,null,null,null,null,null,null,null,null,"2025-02-23",21,"Lucyvo - Sint Anneke",null,"Lucyvo","Sint Anneke"]
[null,null,null,null,null,null,null,null,null,null,null,null,null,null,null,null,null,null,null,null,null,null,null,null,null,null,null,null,null,null,null,"#IF(OR($AE4#0;$AG4#\"\");\"\";OFFSET(spelersstatistieken!$A$4;MATCH(SMALL(coeffsspelers;AE4);coeffsspelers;0);0))","#IF($AE4#0;\"\";IF(AH4#0;\"\";AH4))","#OFFSET(spelersstatistieken!$A$4;MATCH(SMALL(coeffsspelers;AE4);coeffsspelers;0);MatchenPerPloeg+1)",null,null,null,null,null,null,null,{"$f":"RANK(spelersstatistieken!AB28,INDIRECT(\"spelersstatistieken!$\" & $AR$8 & \"$5:$\" & $AR$8 & \"$\" & 5+$AR$6-1))+ROW()/10^4","v":7.0023999999999997},null,null,null,null,null,null,null,null,null,null,null,null,null,null,"2025-03-09",22,"Lucyvo - Jolika",null,"Lucyvo","Jolika"]
[null,null,null,null,null,null,null,null,null,null,null,null,null,null,null,null,null,null,null,null,null,null,null,null,null,null,null,null,null,null,null,"#IF(OR($AE5#0;$AG5#\"\");\"\";OFFSET(spelersstatistieken!$A$4;MATCH(SMALL(coeffsspelers;AE5);coeffsspelers;0);0))","#IF($AE5#0;\"\";IF(AH5#0;\"\";AH5))","#OFFSET(spelersstatistieken!$A$4;MATCH(SMALL(coeffsspelers;AE5);coeffsspelers;0);MatchenPerPloeg+1)",null,null,null,null,null,null,null,{"$f":"RANK(spelersstatistieken!AB29,INDIRECT(\"spelersstatistieken!$\" & $AR$8 & \"$5:$\" & $AR$8 & \"$\" & 5+$AR$6-1))+ROW()/10^4","v":7.0025000000000004},null,null,null,null,null,null,null,null,null,null,null,null,null,null,"2025-03-16",23,"Yerevan United - Lucyvo",null,"Yerevan United","Lucyvo"]
[null,null,null,null,null,null,null,null,null,null,null,null,null,null,null,null,null,null,null,null,null,null,null,null,null,null,null,null,null,null,null,"#IF(OR($AE6#0;$AG6#\"\");\"\";OFFSET(spelersstatistieken!$A$4;MATCH(SMALL(coeffsspelers;AE6);coeffsspelers;0);0))","#IF($AE6#0;\"\";IF(AH6#0;\"\";AH6))","#OFFSET(spelersstatistieken!$A$4;MATCH(SMALL(coeffsspelers;AE6);coeffsspelers;0);MatchenPerPloeg+1)",null,null,null,null,null,null,null,{"$f":"RANK(spelersstatistieken!AB30,INDIRECT(\"spelersstatistieken!$\" & $AR$8 & \"$5:$\" & $AR$8 & \"$\" & 5+$AR$6-1))+ROW()/10^4","v":7.0026000000000002},null,null,null,null,null,null,null,null,null,null,null,null,null,null,"2025-03-23",24,"Lucyvo - Bariton",null,"Lucyvo","Bariton"]
[null,null,null,null,null,null,null,null,null,null,null,null,null,null,null,null,null,null,null,null,null,null,null,null,null,null,null,null,null,null,null,"#IF(OR($AE7#0;$AG7#\"\");\"\";OFFSET(spelersstatistieken!$A$4;MATCH(SMALL(coeffsspelers;AE7);coeffsspelers;0);0))","#IF($AE7#0;\"\";IF(AH7#0;\"\";AH7))","#OFFSET(spelersstatistieken!$A$4;MATCH(SMALL(coeffsspelers;AE7);coeffsspelers;0);MatchenPerPloeg+1)",null,null,null,null,null,null,null,{"$f":"RANK(spelersstatistieken!AB31,INDIRECT(\"spelersstatistieken!$\" & $AR$8 & \"$5:$\" & $AR$8 & \"$\" & 5+$AR$6-1))+ROW()/10^4","v":7.0026999999999999},null,null,null,null,null,null,null,null,null,null,null,null,null,null,"2025-03-30",25,"Antwerp Global - Lucyvo",null,"Antwerp Global","Lucyvo"]
[null,null,null,null,null,null,null,null,null,null,null,null,null,null,null,null,null,null,null,null,null,null,null,null,null,null,null,null,null,null,null,null,null,null,null,null,null,null,null,null,null,{"$f":"RANK(spelersstatistieken!AB32,INDIRECT(\"spelersstatistieken!$\" & $AR$8 & \"$5:$\" & $AR$8 & \"$\" & 5+$AR$6-1))+ROW()/10^4","v":7.0027999999999997},null,null,null,null,null,null,null,null,null,null,null,null,null,null,"2025-04-06",26,"Lucyvo - Racing Emblem",null,"Lucyvo","Racing Emblem"]
[null,null,null,null,null,null,null,null,null,null,null,null,null,null,null,null,null,null,null,null,null,null,null,null,null,null,null,null,null,null,null,null,null,null,null,null,null,null,null,null,null,{"$f":"RANK(spelersstatistieken!AB33,INDIRECT(\"spelersstatistieken!$\" & $AR$8 & \"$5:$\" & $AR$8 & \"$\" & 5+$AR$6-1))+ROW()/10^4","v":2.0028999999999999}]
[null,null,null,null,null,null,null,null,null,null,null,null,null,null,null,null,null,null,null,null,null,null,null,null,null,null,null,null,null,null,null,null,null,null,null,null,null,null,null,null,null,{"$f":"RANK(spelersstatistieken!AB34,INDIRECT(\"spelersstatistieken!$\" & $AR$8 & \"$5:$\" & $AR$8 & \"$\" & 5+$AR$6-1))+ROW()/10^4","v":7.0030000000000001}]
[null,null,null,null,null,null,null,null,null,null,null,null,null,null,null,null,null,null,null,null,null,null,null,null,null,null,null,null,null,null,null,null,null,null,null,null,null,null,null,null,null,{"$f":"RANK(spelersstatistieken!AB35,INDIRECT(\"spelersstatistieken!$\" & $AR$8 & \"$5:$\" & $AR$8 & \"$\" & 5+$AR$6-1))+ROW()/10^4","v":7.0030999999999999}]
[null,null,null,null,null,null,null,null,null,null,null,null,null,null,null,null,null,null,null,null,null,null,null,null,null,null,null,null,null,null,null,null,null,null,null,null,null,null,null,null,null,{"$f":"RANK(spelersstatistieken!AB36,INDIRECT(\"spelersstatistieken!$\" & $AR$8 & \"$5:$\" & $AR$8 & \"$\" & 5+$AR$6-1))+ROW()/10^4","v":3.0032000000000001}]

{"sheet":"spelersstatistieken","index":3,"n_rows":433,"n_cols":131,"rows_kept":433,"cut":false,"hidden":false,"merged":[[0,34,3,34],[0,33,3,33],[0,27,3,27],[0,28,3,28],[0,29,3,29],[0,30,3,30],[0,31,3,31],[0,32,3,32]]}
[null,{"$f":"IF(kalender!$D3='rooster en stand'!$C$3,kalender!$F3&\" (T)\",kalender!$D3&\" (U)\")","v":"Bar Patron (T)"},{"$f":"IF(kalender!$D4='rooster en stand'!$C$3,kalender!$F4&\" (T)\",kalender!$D4&\" (U)\")","v":"Goka (U)"},{"$f":"IF(kalender!$D5='rooster en stand'!$C$3,kalender!$F5&\" (T)\",kalender!$D5&\" (U)\")","v":"Alberta Schilde (T)"},{"$f":"IF(kalender!$D6='rooster en stand'!$C$3,kalender!$F6&\" (T)\",kalender!$D6&\" (U)\")","v":"SC Duffel (U)"},{"$f":"IF(kalender!$D7='rooster en stand'!$C$3,kalender!$F7&\" (T)\",kalender!$D7&\" (U)\")","v":"Hombeek (T)"},{"$f":"IF(kalender!$D8='rooster en stand'!$C$3,kalender!$F8&\" (T)\",kalender!$D8&\" (U)\")","v":"Daltons (U)"},{"$f":"IF(kalender!$D9='rooster en stand'!$C$3,kalender!$F9&\" (T)\",kalender!$D9&\" (U)\")","v":"Corum (T)"},{"$f":"IF(kalender!$D10='rooster en stand'!$C$3,kalender!$F10&\" (T)\",kalender!$D10&\" (U)\")","v":"Sint Anneke (U)"},{"$f":"IF(kalender!$D11='rooster en stand'!$C$3,kalender!$F11&\" (T)\",kalender!$D11&\" (U)\")","v":"Jolika (U)"},{"$f":"IF(kalender!$D12='rooster en stand'!$C$3,kalender!$F12&\" (T)\",kalender!$D12&\" (U)\")","v":"Yerevan United (T)"},{"$f":"IF(kalender!$D13='rooster en stand'!$C$3,kalender!$F13&\" (T)\",kalender!$D13&\" (U)\")","v":"Bariton (U)"},{"$f":"IF(kalender!$D14='rooster en stand'!$C$3,kalender!$F14&\" (T)\",kalender!$D14&\" (U)\")","v":"Antwerp Global (T)"},{"$f":"IF(kalender!$D15='rooster en stand'!$C$3,kalender!$F15&\" (T)\",kalender!$D15&\" (U)\")","v":"Racing Emblem (U)"},{"$f":"IF(kalender!$D16='rooster en stand'!$C$3,kalender!$F16&\" (T)\",kalender!$D16&\" (U)\")","v":"Bar Patron (U)"},{"$f":"IF(kalender!$D17='rooster en stand'!$C$3,kalender!$F17&\" (T)\",kalender!$D17&\" (U)\")","v":"SC Duffel (T)"},{"$f":"IF(kalender!$D18='rooster en stand'!$C$3,kalender!$F18&\" (T)\",kalender!$D18&\" (U)\")","v":"Goka (T)"},{"$f":"IF(kalender!$D19='rooster en stand'!$C$3,kalender!$F19&\" (T)\",kalender!$D19&\" (U)\")","v":"Alberta Schilde (U)"},{"$f":"IF(kalender!$D20='rooster en stand'!$C$3,kalender!$F20&\" (T)\",kalender!$D20&\" (U)\")","v":"Hombeek (U)"},{"$f":"IF(kalender!$D21='rooster en stand'!$C$3,kalender!$F21&\" (T)\",kalender!$D21&\" (U)\")","v":"Daltons (T)"},{"$f":"IF(kalender!$D22='rooster en stand'!$C$3,kalender!$F22&\" (T)\",kalender!$D22&\" (U)\")","v":"Corum (U)"},{"$f":"IF(kalender!$D23='rooster en stand'!$C$3,kalender!$F23&\" (T)\",kalender!$D23&\" (U)\")","v":"Sint Anneke (T)"},{"$f":"IF(kalender!$D24='rooster en stand'!$C$3,kalender!$F24&\" (T)\",kalender!$D24&\" (U)\")","v":"Jolika (T)"},{"$f":"IF(kalender!$D25='rooster en stand'!$C$3,kalender!$F25&\" (T)\",kalender!$D25&\" (U)\")","v":"Yerevan United (U)"},{"$f":"IF(kalender!$D26='rooster en stand'!$C$3,kalender!$F26&\" (T)\",kalender!$D26&\" (U)\")","v":"Bariton (T)"},{"$f":"IF(kalender!$D27='rooster en stand'!$C$3,kalender!$F27&\" (T)\",kalender!$D27&\" (U)\")","v":"Antwerp Global (U)"},{"$f":"IF(kalender!$D28='rooster en stand'!$C$3,kalender!$F28&\" (T)\",kalender!$D28&\" (U)\")","v":"Racing Emblem (T)"},"Totaal # goals","# matchen","Gem. # goals","Afwezig","Blessure","Schorsing","Niet gespeeld totaal","Keeper",null,null,null,{"$f":"IFERROR( _xlfn.XMATCH( AN2, B4:AA4, 0 ), 0 )","v":6},{"$f":"\"Hint: \" & MAX(B4:AA4)","v":"Hint: 6"},null,{"$f":"B1","v":"Bar Patron (T)"},"Goka (U)","Alberta Schilde (T)","SC Duffel (U)","Hombeek (T)","Daltons (U)","Corum (T)","Sint Anneke (U)",{"$f":"J1","v":"Jolika (U)"},"Yerevan United (T)","Bariton (U)","Antwerp Global (T)",{"$f":"N1","v":"Racing Emblem (U)"},"Bar Patron (U)","SC Duffel (T)","Goka (T)","Alberta Schilde (U)","Hombeek (U)","Daltons (T)","Corum (U)","Sint Anneke (T)","Jolika (T)","Yerevan United (U)","Bariton (T)","Antwerp Global (U)","Racing Emblem (T)",null,null,null,null,null,null,null,null,null,null,null,null,null,null,null,null,null,null,null,null,null,null,null,null,null,null,null,null,null,null,null,null,null,null,null,null,null,null,null,null,"Maak dynamisch: CV5 / DE5"]
["Uitslag",{"$f":"TRANSPOSE( kalender!G3:G28 )","v":"2-4"},"3-0","1-5","3-1","5-1","3-0","","","","","","","","","","","","","","","","","","","","",null,null,null,null,null,null,null,null,null,null,null,null,6,null,null,null,null,null,null,null,null,null,null,null,null,null,null,null,null,null,null,null,null,null,null,null,null,null,null,null,null,"P","coeff","coeff aflopend",null,"P","coeff","coeff aflopend",null,"aantal","coeff","coeff aflopend",null,null,null,null,null,{"$f":"MAX( CG5:CG37 )","v":14.285714285714286},{"$f":"MAX( 1, CE5:CE36, CL5:CL36 )","v":24},null,null,null,null,null,{"$f":"MAX( CN5:CN37 )","v":60.241830065359473},null,null,null,null,null,null,null,null,null,null,{"$f":"MAX( 1, CX5:CX36, DC5:DC36 )","v":13},null,null,null,null,null,null,null,null,null,{"$f":"MAX( DI5:DI37 )","v":6.0000499999999999},null,null,null,null,null,null,null,null,null,null,null,null,null,null,null,{"$f":"_xlfn.TAKE( _xlfn.SCAN( \"\", _xlfn._xlws.SORT( _xlfn.UNIQUE( _xlfn.TOCOL(_xlfn.ANCHORARRAY( DN5), 2 ))), _xlfn.LAMBDA(_xlpm.a,_xlpm.v, IF( COUNTIF( $CY$5:$CY$38, _xlpm.v ) > 0, _xlpm.a, _xlpm.a & \" / \" & _xlpm.v ))), -1 )","v":" / Celis Ive / Coolsaet Joy / De Groof Maarten / De Groof Steven / De Vinster Glenn / Delen Robbe / Elst Pieter / Gielis Bernd / Hofmans Stijn / Jordens Koen / Langenaeker Maarten / Nyckees Wannes / Stevens Siebe"}]
["Aanwezigen",{"$f":"IF(COUNTBLANK(B5:B36)='export html'!$AR$6,\"\",'export html'!$AR$6-COUNTIF(B5:B36,\"a\")-COUNTIF(B5:B36,\"b\")-COUNTIF(B5:B36,\"s\"))","v":19},{"$f":"IF(COUNTBLANK(C5:C36)='export html'!$AR$6,\"\",'export html'!$AR$6-COUNTIF(C5:C36,\"a\")-COUNTIF(C5:C36,\"b\")-COUNTIF(C5:C36,\"s\"))","v":16},{"$f":"IF(COUNTBLANK(D5:D36)='export html'!$AR$6,\"\",'export html'!$AR$6-COUNTIF(D5:D36,\"a\")-COUNTIF(D5:D36,\"b\")-COUNTIF(D5:D36,\"s\"))","v":21},{"$f":"IF(COUNTBLANK(E5:E36)='export html'!$AR$6,\"\",'export html'!$AR$6-COUNTIF(E5:E36,\"a\")-COUNTIF(E5:E36,\"b\")-COUNTIF(E5:E36,\"s\"))","v":16},{"$f":"IF(COUNTBLANK(F5:F36)='export html'!$AR$6,\"\",'export html'!$AR$6-COUNTIF(F5:F36,\"a\")-COUNTIF(F5:F36,\"b\")-COUNTIF(F5:F36,\"s\"))","v":17},{"$f":"IF(COUNTBLANK(G5:G36)='export html'!$AR$6,\"\",'export html'!$AR$6-COUNTIF(G5:G36,\"a\")-COUNTIF(G5:G36,\"b\")-COUNTIF(G5:G36,\"s\"))","v":14},{"$f":"IF(COUNTBLANK(H5:H36)='export html'!$AR$6,\"\",'export html'!$AR$6-COUNTIF(H5:H36,\"a\")-COUNTIF(H5:H36,\"b\")-COUNTIF(H5:H36,\"s\"))","v":""},{"$f":"IF(COUNTBLANK(I5:I36)='export html'!$AR$6,\"\",'export html'!$AR$6-COUNTIF(I5:I36,\"a\")-COUNTIF(I5:I36,\"b\")-COUNTIF(I5:I36,\"s\"))","v":""},{"$f":"IF(COUNTBLANK(J5:J36)='export html'!$AR$6,\"\",'export html'!$AR$6-COUNTIF(J5:J36,\"a\")-COUNTIF(J5:J36,\"b\")-COUNTIF(J5:J36,\"s\"))","v":""},{"$f":"IF(COUNTBLANK(K5:K36)='export html'!$AR$6,\"\",'export html'!$AR$6-COUNTIF(K5:K36,\"a\")-COUNTIF(K5:K36,\"b\")-COUNTIF(K5:K36,\"s\"))","v":""},{"$f":"IF(COUNTBLANK(L5:L36)='export html'!$AR$6,\"\",'export html'!$AR$6-COUNTIF(L5:L36,\"a\")-COUNTIF(L5:L36,\"b\")-COUNTIF(L5:L36,\"s\"))","v":""},{"$f":"IF(COUNTBLANK(M5:M36)='export html'!$AR$6,\"\",'export html'!$AR$6-COUNTIF(M5:M36,\"a\")-COUNTIF(M5:M36,\"b\")-COUNTIF(M5:M36,\"s\"))","v":""},{"$f":"IF(COUNTBLANK(N5:N36)='export html'!$AR$6,\"\",'export html'!$AR$6-COUNTIF(N5:N36,\"a\")-COUNTIF(N5:N36,\"b\")-COUNTIF(N5:N36,\"s\"))","v":""},{"$f":"IF(COUNTBLANK(O5:O36)='export html'!$AR$6,\"\",'export html'!$AR$6-COUNTIF(O5:O36,\"a\")-COUNTIF(O5:O36,\"b\")-COUNTIF(O5:O36,\"s\"))","v":""},{"$f":"IF(COUNTBLANK(P5:P36)='export html'!$AR$6,\"\",'export html'!$AR$6-COUNTIF(P5:P36,\"a\")-COUNTIF(P5:P36,\"b\")-COUNTIF(P5:P36,\"s\"))","v":""},{"$f":"IF(COUNTBLANK(Q5:Q36)='export html'!$AR$6,\"\",'export html'!$AR$6-COUNTIF(Q5:Q36,\"a\")-COUNTIF(Q5:Q36,\"b\")-COUNTIF(Q5:Q36,\"s\"))","v":""},{"$f":"IF(COUNTBLANK(R5:R36)='export html'!$AR$6,\"\",'export html'!$AR$6-COUNTIF(R5:R36,\"a\")-COUNTIF(R5:R36,\"b\")-COUNTIF(R5:R36,\"s\"))","v":""},{"$f":"IF(COUNTBLANK(S5:S36)='export html'!$AR$6,\"\",'export html'!$AR$6-COUNTIF(S5:S36,\"a\")-COUNTIF(S5:S36,\"b\")-COUNTIF(S5:S36,\"s\"))","v":""},{"$f":"IF(COUNTBLANK(T5:T36)='export html'!$AR$6,\"\",'export html'!$AR$6-COUNTIF(T5:T36,\"a\")-COUNTIF(T5:T36,\"b\")-COUNTIF(T5:T36,\"s\"))","v":""},{"$f":"IF(COUNTBLANK(U5:U36)='export html'!$AR$6,\"\",'export html'!$AR$6-COUNTIF(U5:U36,\"a\")-COUNTIF(U5:U36,\"b\")-COUNTIF(U5:U36,\"s\"))","v":""},{"$f":"IF(COUNTBLANK(V5:V36)='export html'!$AR$6,\"\",'export html'!$AR$6-COUNTIF(V5:V36,\"a\")-COUNTIF(V5:V36,\"b\")-COUNTIF(V5:V36,\"s\"))","v":""},{"$f":"IF(COUNTBLANK(W5:W36)='export html'!$AR$6,\"\",'export html'!$AR$6-COUNTIF(W5:W36,\"a\")-COUNTIF(W5:W36,\"b\")-COUNTIF(W5:W36,\"s\"))","v":""},{"$f":"IF(COUNTBLANK(X5:X36)='export html'!$AR$6,\"\",'export html'!$AR$6-COUNTIF(X5:X36,\"a\")-COUNTIF(X5:X36,\"b\")-COUNTIF(X5:X36,\"s\"))","v":""},{"$f":"IF(COUNTBLANK(Y5:Y36)='export html'!$AR$6,\"\",'export html'!$AR$6-COUNTIF(Y5:Y36,\"a\")-COUNTIF(Y5:Y36,\"b\")-COUNTIF(Y5:Y36,\"s\"))","v":""},{"$f":"IF(COUNTBLANK(Z5:Z36)='export html'!$AR$6,\"\",'export html'!$AR$6-COUNTIF(Z5:Z36,\"a\")-COUNTIF(Z5:Z36,\"b\")-COUNTIF(Z5:Z36,\"s\"))","v":""},{"$f":"IF(COUNTBLANK(AA5:AA36)='export html'!$AR$6,\"\",'export html'!$AR$6-COUNTIF(AA5:AA36,\"a\")-COUNTIF(AA5:AA36,\"b\")-COUNTIF(AA5:AA36,\"s\"))","v":""},null,null,null,null,null,null,null,null,null,"Match van de Man",null,null,null,null,null,null,null,null,null,null,null,null,null,null,null,null,null,null,null,null,null,null,null,null,null,null,null,null,null,null,null,"DEZE WEEK",null,null,null,"SEIZOEN",null,null,null,"WEEKOVERWINNINGEN",null,null,null,null,null,null,null,null,null,null,null,null,null,null,null,null,null,null,null,null,null,null,null,null,null,null,null,null,null,null,null,null,null,null,null,null,null,null,null,null,null,null,null,null,null,null,null,null,null,null,null,{"$f":"_xlfn.TEXTJOIN( \"|\",TRUE, _xlfn.DROP( _xlfn.TEXTSPLIT( DY2, , \" / \" ), 1 ))","v":"Celis Ive|Coolsaet Joy|De Groof Maarten|De Groof Steven|De Vinster Glenn|Delen Robbe|Elst Pieter|Gielis Bernd|Hofmans Stijn|Jordens Koen|Langenaeker Maarten|Nyckees Wannes|Stevens Siebe"}]
["Speeldag",{"$f":"IF(COUNTBLANK(B5:B36)='export html'!$AR$6,\"\",kalender!$B3)","v":1},{"$f":"IF(COUNTBLANK(C5:C36)='export html'!$AR$6,\"\",kalender!$B4)","v":2},{"$f":"IF(COUNTBLANK(D5:D36)='export html'!$AR$6,\"\",kalender!$B5)","v":3},{"$f":"IF(COUNTBLANK(E5:E36)='export html'!$AR$6,\"\",kalender!$B6)","v":4},{"$f":"IF(COUNTBLANK(F5:F36)='export html'!$AR$6,\"\",kalender!$B7)","v":5},{"$f":"IF(COUNTBLANK(G5:G36)='export html'!$AR$6,\"\",kalender!$B8)","v":6},{"$f":"IF(COUNTBLANK(H5:H36)='export html'!$AR$6,\"\",kalender!$B9)","v":""},{"$f":"IF(COUNTBLANK(I5:I36)='export html'!$AR$6,\"\",kalender!$B10)","v":""},{"$f":"IF(COUNTBLANK(J5:J36)='export html'!$AR$6,\"\",kalender!$B11)","v":""},{"$f":"IF(COUNTBLANK(K5:K36)='export html'!$AR$6,\"\",kalender!$B12)","v":""},{"$f":"IF(COUNTBLANK(L5:L36)='export html'!$AR$6,\"\",kalender!$B13)","v":""},{"$f":"IF(COUNTBLANK(M5:M36)='export html'!$AR$6,\"\",kalender!$B14)","v":""},{"$f":"IF(COUNTBLANK(N5:N36)='export html'!$AR$6,\"\",kalender!$B15)","v":""},{"$f":"IF(COUNTBLANK(O5:O36)='export html'!$AR$6,\"\",kalender!$B16)","v":""},{"$f":"IF(COUNTBLANK(P5:P36)='export html'!$AR$6,\"\",kalender!$B17)","v":""},{"$f":"IF(COUNTBLANK(Q5:Q36)='export html'!$AR$6,\"\",kalender!$B18)","v":""},{"$f":"IF(COUNTBLANK(R5:R36)='export html'!$AR$6,\"\",kalender!$B19)","v":""},{"$f":"IF(COUNTBLANK(S5:S36)='export html'!$AR$6,\"\",kalender!$B20)","v":""},{"$f":"IF(COUNTBLANK(T5:T36)='export html'!$AR$6,\"\",kalender!$B21)","v":""},{"$f":"IF(COUNTBLANK(U5:U36)='export html'!$AR$6,\"\",kalender!$B22)","v":""},{"$f":"IF(COUNTBLANK(V5:V36)='export html'!$AR$6,\"\",kalender!$B23)","v":""},{"$f":"IF(COUNTBLANK(W5:W36)='export html'!$AR$6,\"\",kalender!$B24)","v":""},{"$f":"IF(COUNTBLANK(X5:X36)='export html'!$AR$6,\"\",kalender!$B25)","v":""},{"$f":"IF(COUNTBLANK(Y5:Y36)='export html'!$AR$6,\"\",kalender!$B26)","v":""},{"$f":"IF(COUNTBLANK(Z5:Z36)='export html'!$AR$6,\"\",kalender!$B27)","v":""},{"$f":"IF(COUNTBLANK(AA5:AA36)='export html'!$AR$6,\"\",kalender!$B28)","v":""},null,null,null,null,null,null,null,null,null,"Speler","Totaal","Plaats",{"$f":"INDEX( B1:AA1, 1, MATCH( AN2, B4:AA4, 0 ))","v":"Daltons (U)"},"Plaats",null,null,null,null,null,null,null,null,null,null,null,null,null,null,null,null,null,null,null,null,null,null,null,null,null,null,null,null,null,null,null,null,null,null,null,null,null,null,null,null,null,null,{"$f":"\"Match tegen \" & AN4","v":"Match tegen Daltons (U)"},"Punten -\nGEWOGEN","Punten -\nONGEWOGEN",null,null,null,null,"Seizoenstotaal","Punten -\nGEWOGEN","Punten -\nONGEWOGEN","Matchen",null,null,"HULP 1","HULP 2","HULP 3","HULP 4",null,null,"Weekoverwinningen","Aantal","Matchen",null,null,"Podiumplaatsen","Goud","Zilver","Brons","Totaal","Goud = 3\nZilver = 2\nBrons = 1",null,null,"Ook op het podium:",null,null,"",null,null,"Speler","Plaats 1","Plaats 2","Plaats 3","Totaal","Gewogen som"]
["Beckx Pieter-Alexander","a","a","a",1,"a","a",null,null,null,null,null,null,null,null,null,null,null,null,null,null,null,null,null,null,null,null,{"$f":"SUM( B102:AA102 )","v":0},{"$f":"COUNTIF( B5:AA5, \"k\" ) + SUM( B5:AA5 )","v":1},{"$f":"IFERROR( AB5 / COUNT($B$4:$AA$4), \"\" )","v":0},{"$f":"COUNTIF( B5:AA5, \"a\" )","v":5},{"$f":"COUNTIF( B5:AA5, \"b\" )","v":0},{"$f":"COUNTIF( B5:AA5, \"s\" )","v":0},{"$f":"COUNTIF( B5:AA5, \"ng\" ) + COUNTIF( B5:AA5, \"na\" ) + COUNTIF( B5:AA5, \"p\" ) + COUNTIF( B5:AA5, \"t\" )","v":0},{"$f":"COUNTIF(B5:AA5,\"k\")","v":0},1,{"$f":"A5","v":"Beckx Pieter-Alexander"},{"$f":"IF(SUM(AP5:BO5)=0,\"\",SUM(AP5:BO5))","v":""},{"$f":"IF(AL5=\"\",\"\",RANK(AL5,AL$5:AL$39))","v":""},{"$f":"_xlfn.LET( _xlpm.i, INDEX($AP5:$BO5,1,MAX(1,MATCH($AN$2,$B$4:$AA$4,0))), IF( _xlpm.i = \"\", \"\", _xlpm.i ))","v":0},{"$f":"IF(AN5=\"\",\"\",RANK(AN5,AN$5:AN$39))","v":12},{"$f":"B352","v":0},{"$f":"C352","v":0},{"$f":"D352","v":0},{"$f":"E352","v":0},{"$f":"F352","v":0},{"$f":"G352","v":0},{"$f":"H352","v":0},{"$f":"I352","v":0},{"$f":"J352","v":0},{"$f":"K352","v":0},{"$f":"L352","v":0},{"$f":"M352","v":0},{"$f":"N352","v":0},{"$f":"O352","v":0},{"$f":"P352","v":0},{"$f":"Q352","v":0},{"$f":"R352","v":0},{"$f":"S352","v":0},{"$f":"T352","v":0},{"$f":"U352","v":0},{"$f":"V352","v":0},{"$f":"W352","v":0},{"$f":"X352","v":0},{"$f":"Y352","v":0},{"$f":"Z352","v":0},{"$f":"AA352","v":0},null,{"$f":"INDEX($AP5:$BO5,1,MAX(1,MATCH($AN$2,$B$4:$AA$4,0)))","v":0},{"$f":"BQ5-CC5/100","v":-0.01},{"$f":"LARGE(BR$5:BR$38,CC5)","v":14.125714285714286},null,{"$f":"SUM(AP5:BO5)","v":0},{"$f":"BU5-CC5/100","v":-0.01},{"$f":"LARGE(BV$5:BV$38,CC5)","v":60.04183006535947},null,{"$f":"COUNTIF( $AP$43:$BO$43, \"*\" & AK5 & \"*\" )","v":0},{"$f":"1000*BY5+BU5-CC5/100","v":-0.01},{"$f":"LARGE(BZ$5:BZ$38,CC5)","v":2056.6141643323995},null,{"$f":"_xlfn.SEQUENCE(33)","v":1},null,{"$f":"IF(CG5=\"\",\"\",CC5)","v":1},{"$f":"_xlfn.XLOOKUP( CS5, $DZ$5:$DZ$37, $EA$5:$EA$37, \"\" )","v":"Bernd Gielis"},{"$f":"IF(INDEX($BQ$5:$BQ$38,MATCH(BS5,$BR$5:$BR$38,0))=0,\"\",INDEX($BQ$5:$BQ$38,MATCH(BS5,$BR$5:$BR$38,0)))","v":14.285714285714286},{"$f":"IF( CS5 = \"\", \"\", _xlfn.XLOOKUP( CS5, $A$302:$A$334, INDEX( $B$302:$AA$334, , $AM$1 ), \"\" ))","v":10},null,null,null,{"$f":"IF(CN5=\"\",\"\",CC5)","v":1},{"$f":"_xlfn.XLOOKUP( CT5, $DZ$5:$DZ$37, $EA$5:$EA$37, \"\" )","v":"Maarten Langenaeker"},{"$f":"IF(INDEX($BU$5:$BU$38,MATCH(BW5,$BV$5:$BV$38,0))=0,\"\",INDEX($BU$5:$BU$38,MATCH(BW5,$BV$5:$BV$38,0)))","v":60.241830065359473},{"$f":"IF( CT5 = \"\", \"\", _xlfn.XLOOKUP( CT5, $A$302:$A$334, $AB$302:$AB$334, \"\" ))","v":50},{"$f":"_xlfn.LET( _xlpm.m, INDEX($AC$5:$AC$38,MATCH(CT5,$AK$5:$AK$38,0)),\nIF(CN5=\"\",\"\",\"(\" & IF( _xlpm.m = \"\", 0, _xlpm.m ) & \")\"))","v":"(6)"},{"$f":"IFERROR(IF(CN5=\"\",\"\",ABS(CN5/CP5)),0)","v":10.040305010893245},null,{"$f":"IF(CG5=\"\",\"\",INDEX($AK$5:$AK$39,MATCH(BS5,$BR$5:$BR$38,0)))","v":"Gielis Bernd"},{"$f":"IF(CN5=\"\",\"\",INDEX($AK$5:$AK$38,MATCH(BW5,$BV$5:$BV$38,0)))","v":"Langenaeker Maarten"},{"$f":"IF(CZ5=\"\",\"\",INDEX($AK$5:$AK$38,MATCH(CA5,$BZ$5:$BZ$38,0)))","v":"De Vinster Glenn"},{"$f":"_xlfn.TAKE( _xlfn.SORTBY( DR5:DW17,_xlfn.ANCHORARRAY( DW5), -1 ), , 1 )","v":"De Vinster Glenn"},null,{"$f":"IF(CZ5=\"\",\"\",CC5)","v":1},{"$f":"_xlfn.XLOOKUP( CU5, $DZ$5:$DZ$37, $EA$5:$EA$37, \"\" )","v":"Glenn De Vinster"},{"$f":"IF(INDEX($BY$5:$BY$38,MATCH(CA5,$BZ$5:$BZ$38,0))=0,\"\",INDEX($BY$5:$BY$38,MATCH(CA5,$BZ$5:$BZ$38,0)))","v":2},{"$f":"IF(CZ5=\"\",\"\",\"(\" & INDEX($AC$5:$AC$38,MATCH(CU5,$AK$5:$AK$38,0)) & \")\")","v":"(5)"},null,{"$f":"_xlfn.SEQUENCE( ROWS(_xlfn.ANCHORARRAY( DR5) ))","v":1},{"$f":"_xlfn.XLOOKUP(_xlfn.ANCHORARRAY( CV5), $DZ$5:$DZ$37, $EA$5:$EA$37, \"\" )","v":"Glenn De Vinster"},{"$f":"_xlfn.DROP( _xlfn.SORTBY( DR5:DW17,_xlfn.ANCHORARRAY( DW5), -1 ), , 1 )","v":2},0,0,2,6.0000499999999999,null,null,{"$f":"_xlfn.LET( _xlpm.n, _xlfn.TOCOL( AP43:BO45, 1 ),\n_xlfn._xlws.FILTER( _xlpm.n, _xlpm.n <> \"\", \"Niets weer te geven.\" ))","v":"Nyckees Wannes"},null,{"$f":"_xlfn.LET(\n     _xlpm.a,_xlfn.ANCHORARRAY( DL5),\n     _xlpm.b, (LEN(_xlpm.a) - LEN(SUBSTITUTE(_xlpm.a, \" / \",)))/LEN( \" / \" ) +1,\n     _xlpm.c, _xlfn.SEQUENCE( , MAX(_xlpm.b)),\n     IFERROR( _xlfn.TEXTSPLIT( _xlfn.TEXTAFTER( \" / \" & _xlpm.a & \" / \",\" / \", _xlpm.c ), \" / \"), NA() ))","v":"Nyckees Wannes"},{"$error":"#N/A"},null,null,{"$f":"_xlfn.UNIQUE( _xlfn.TOCOL(_xlfn.ANCHORARRAY( DN5), 2 ))","v":"Nyckees Wannes"},{"$f":"COUNTIF( $AP$43:$BO$43, \"*\" &_xlfn.ANCHORARRAY( DR5) & \"*\" )","v":1},{"$f":"COUNTIF( $AP$44:$BO$44, \"*\" &_xlfn.ANCHORARRAY( DR5) & \"*\" )","v":1},{"$f":"COUNTIF( $AP$45:$BO$45, \"*\" &_xlfn.ANCHORARRAY( DR5) & \"*\" )","v":0},{"$f":"_xlfn.ANCHORARRAY(DS5) +_xlfn.ANCHORARRAY( DT5) +_xlfn.ANCHORARRAY( DU5)","v":2},{"$f":"3 *_xlfn.ANCHORARRAY( DS5) + 2 *_xlfn.ANCHORARRAY( DT5) + 1 *_xlfn.ANCHORARRAY( DU5) + ROW()/100000","v":5.0000499999999999},null,null,{"$f":"A5","v":"Beckx Pieter-Alexander"},"Pieter-Alexander Beckx"]
["Beirinckx Geert","p","a","t","t","t","a",null,null,null,null,null,null,null,null,null,null,null,null,null,null,null,null,null,null,null,null,0,0,0,2,0,0,4,{"$f":"COUNTIF(B6:AA6,\"k\")","v":0},0,"Beirinckx Geert",{"$f":"IF(SUM(AP6:BO6)=0,\"\",SUM(AP6:BO6))","v":""},"",{"$f":"_xlfn.LET( _xlpm.i, INDEX($AP6:$BO6,1,MAX(1,MATCH($AN$2,$B$4:$AA$4,0))), IF( _xlpm.i = \"\", \"\", _xlpm.i ))","v":0},12,0,0,0,0,0,0,0,0,0,0,0,0,0,0,0,0,0,0,0,0,0,0,0,0,0,0,null,{"$f":"INDEX($AP6:$BO6,1,MAX(1,MATCH($AN$2,$B$4:$AA$4,0)))","v":0},-0.02,{"$f":"LARGE(BR$5:BR$38,CC6)","v":12.797142857142857},null,0,{"$f":"BU6-CC6/100","v":-0.02},56.614164332399625,null,0,{"$f":"1000*BY6+BU6-CC6/100","v":-0.02},1060.0418300653594,null,2,null,{"$f":"IF(CG6=\"\",\"\",CC6)","v":2},"Ive Celis",12.857142857142858,{"$f":"IF( CS6 = \"\", \"\", _xlfn.XLOOKUP( CS6, $A$302:$A$334, INDEX( $B$302:$AA$334, , $AM$1 ), \"\" ))","v":9},null,null,null,{"$f":"IF(CN6=\"\",\"\",CC6)","v":2},"Glenn De Vinster",56.744164332399627,47,"(5)",11.348832866479926,null,"Celis Ive","De Vinster Glenn","Langenaeker Maarten","Langenaeker Maarten",null,2,"Maarten Langenaeker",1,"(6)",null,2,"Maarten Langenaeker",1,0,3,4,6.0000499999999999,null,null,"De Vinster Glenn",null,"De Vinster Glenn",{"$error":"#N/A"},null,null,"De Vinster Glenn",2,0,0,2,6.0000499999999999,null,null,{"$f":"A6","v":"Beirinckx Geert"},"Geert Beirinckx"]
["Beirinckx Jurgen",1,"ng","ng",1,"p","p",null,null,null,null,null,null,null,null,null,null,null,null,null,null,null,null,null,null,null,null,0,2,0,0,0,0,4,0,2,"Beirinckx Jurgen",2.2222222222222223,24,{"$f":"_xlfn.LET( _xlpm.i, INDEX($AP7:$BO7,1,MAX(1,MATCH($AN$2,$B$4:$AA$4,0))), IF( _xlpm.i = \"\", \"\", _xlpm.i ))","v":0},12,2.2222222222222223,0,0,0,0,0,0,0,0,0,0,0,0,0,0,0,0,0,0,0,0,0,0,0,0,0,null,{"$f":"INDEX($AP7:$BO7,1,MAX(1,MATCH($AN$2,$B$4:$AA$4,0)))","v":0},-0.03,12.747142857142858,null,2.2222222222222223,{"$f":"BU7-CC7/100","v":2.1922222222222225},47.364052287581693,null,0,{"$f":"1000*BY7+BU7-CC7/100","v":2.1922222222222225},1038.0022222222221,null,3,null,3,"Steven De Groof",12.857142857142858,{"$f":"IF( CS7 = \"\", \"\", _xlfn.XLOOKUP( CS7, $A$302:$A$334, INDEX( $B$302:$AA$334, , $AM$1 ), \"\" ))","v":9},null,null,null,3,"Maarten De Groof",47.464052287581694,41,"(5)",9.4928104575163381,null,"De Groof Steven","De Groof Maarten","Nyckees Wannes","Nyckees Wannes",null,3,"Wannes Nyckees",1,"(2)",null,3,"Wannes Nyckees",1,1,0,2,5.0000499999999999,null,null,"Delen Robbe",null,"Delen Robbe",{"$error":"#N/A"},null,null,"Delen Robbe",1,0,0,1,3.0000499999999999,null,null,"Beirinckx Jurgen","Jurgen Beirinckx"]
["Beirinckx Wout","a",1,1,1,1,1,null,null,null,null,null,null,null,null,null,null,null,null,null,null,null,null,null,null,null,null,1,5,0.16666666666666666,1,0,0,0,0,4,"Beirinckx Wout",26.238095238095241,8,{"$f":"_xlfn.LET( _xlpm.i, INDEX($AP8:$BO8,1,MAX(1,MATCH($AN$2,$B$4:$AA$4,0))), IF( _xlpm.i = \"\", \"\", _xlpm.i ))","v":8.5714285714285712},6,0,9.3333333333333339,7,1.3333333333333333,0,8.5714285714285712,0,0,0,0,0,0,0,0,0,0,0,0,0,0,0,0,0,0,0,0,null,{"$f":"INDEX($AP8:$BO8,1,MAX(1,MATCH($AN$2,$B$4:$AA$4,0)))","v":8.5714285714285712},8.531428571428572,9.93,null,26.238095238095241,26.198095238095242,40.623921568627452,null,0,26.198095238095242,1019.86,null,4,null,4,"Joy Coolsaet",10,{"$f":"IF( CS8 = \"\", \"\", _xlfn.XLOOKUP( CS8, $A$302:$A$334, INDEX( $B$302:$AA$334, , $AM$1 ), \"\" ))","v":7},null,null,null,{"$f":"IF(CN8=\"\",\"\",CC8)","v":4},"Stijn Hofmans",40.803921568627452,35,"(4)",10.200980392156863,null,"Coolsaet Joy","Hofmans Stijn","Delen Robbe","Hofmans Stijn",null,4,"Robbe Delen",1,"(1)",null,4,"Stijn Hofmans",0,2,0,2,4.0000499999999999,null,null,"Langenaeker Maarten",null,"Langenaeker Maarten",{"$error":"#N/A"},null,null,"Langenaeker Maarten",1,0,3,4,6.0000499999999999,null,null,"Beirinckx Wout","Wout Beirinckx"]
["Boes Dieuwer",1,1,1,1,"a",1,null,null,null,null,null,null,null,null,null,null,null,null,null,null,null,null,null,null,null,null,0,5,0,1,0,0,0,0,4,"Boes Dieuwer",18.904761904761905,14,{"$f":"_xlfn.LET( _xlpm.i, INDEX($AP9:$BO9,1,MAX(1,MATCH($AN$2,$B$4:$AA$4,0))), IF( _xlpm.i = \"\", \"\", _xlpm.i ))","v":8.5714285714285712},6,0,5.333333333333333,1,4,0,8.5714285714285712,0,0,0,0,0,0,0,0,0,0,0,0,0,0,0,0,0,0,0,0,null,{"$f":"INDEX($AP9:$BO9,1,MAX(1,MATCH($AN$2,$B$4:$AA$4,0)))","v":8.5714285714285712},8.5214285714285705,9.8000000000000007,null,18.904761904761905,18.854761904761904,38.002222222222223,null,0,18.854761904761904,1016.1257142857144,null,5,null,5,"Maarten Langenaeker",10,{"$f":"IF( CS9 = \"\", \"\", _xlfn.XLOOKUP( CS9, $A$302:$A$334, INDEX( $B$302:$AA$334, , $AM$1 ), \"\" ))","v":7},null,null,null,5,"Wannes Nyckees",38.222222222222221,32,"(2)",19.111111111111111,null,"Langenaeker Maarten","Nyckees Wannes","Gielis Bernd","De Groof Maarten",null,5,"Bernd Gielis",1,"(2)",null,5,"Maarten De Groof",0,2,0,2,4.0000499999999999,null,null,"De Vinster Glenn",null,"De Vinster Glenn",{"$error":"#N/A"},null,null,"Gielis Bernd",1,0,0,1,3.0000499999999999,null,null,"Boes Dieuwer","Dieuwer Boes"]
["Celis Ive","a","a",1,"a",1,1,null,null,null,null,null,null,null,null,null,null,null,null,null,null,null,null,null,null,null,null,0,3,0,3,0,0,0,0,2,"Celis Ive",28.798319327731093,7,{"$f":"_xlfn.LET( _xlpm.i, INDEX($AP10:$BO10,1,MAX(1,MATCH($AN$2,$B$4:$AA$4,0))), IF( _xlpm.i = \"\", \"\", _xlpm.i ))","v":12.857142857142858},2,0,0,3,0,12.941176470588236,12.857142857142858,0,0,0,0,0,0,0,0,0,0,0,0,0,0,0,0,0,0,0,0,null,{"$f":"INDEX($AP10:$BO10,1,MAX(1,MATCH($AN$2,$B$4:$AA$4,0)))","v":12.857142857142858},12.797142857142857,8.531428571428572,null,28.798319327731093,28.738319327731094,35.647385620915031,null,0,28.738319327731094,47.364052287581693,null,6,null,{"$f":"IF(CG10=\"\",\"\",CC10)","v":6},"Wout Beirinckx",8.5714285714285712,{"$f":"IF( CS10 = \"\", \"\", _xlfn.XLOOKUP( CS10, $A$302:$A$334, INDEX( $B$302:$AA$334, , $AM$1 ), \"\" ))","v":6},null,null,null,6,"Pieter Elst",35.79738562091503,31,"(4)",8.9493464052287575,null,"Beirinckx Wout","Elst Pieter","","Delen Robbe",null,"","","","",null,6,"Robbe Delen",1,0,0,1,3.0000499999999999,null,null,"Gielis Bernd",null,"Gielis Bernd",{"$error":"#N/A"},null,null,"Hofmans Stijn",0,2,0,2,4.0000499999999999,null,null,"Celis Ive","Ive Celis"]
["Coolsaet Joy","a","a","td",1,"td",1,null,null,null,null,null,null,null,null,null,null,null,null,null,null,null,null,null,null,null,null,0,2,0,2,0,0,0,0,1,"Coolsaet Joy",20.333333333333336,12,{"$f":"_xlfn.LET( _xlpm.i, INDEX($AP11:$BO11,1,MAX(1,MATCH($AN$2,$B$4:$AA$4,0))), IF( _xlpm.i = \"\", \"\", _xlpm.i ))","v":10},4,0,0,1,9.3333333333333339,0,10,0,0,0,0,0,0,0,0,0,0,0,0,0,0,0,0,0,0,0,0,null,{"$f":"INDEX($AP11:$BO11,1,MAX(1,MATCH($AN$2,$B$4:$AA$4,0)))","v":10},9.93,8.5214285714285705,null,20.333333333333336,20.263333333333335,28.738319327731094,null,0,{"$f":"1000*BY11+BU11-CC11/100","v":20.263333333333335},40.623921568627452,null,7,null,7,"Dieuwer Boes",8.5714285714285712,{"$f":"IF( CS11 = \"\", \"\", _xlfn.XLOOKUP( CS11, $A$302:$A$334, INDEX( $B$302:$AA$334, , $AM$1 ), \"\" ))","v":6},null,null,null,7,"Ive Celis",28.798319327731093,23,"(3)",9.5994397759103638,null,"Boes Dieuwer","Celis Ive","","Gielis Bernd",null,"","","","",null,7,"Bernd Gielis",1,0,0,1,3.0000499999999999,null,null,"Hofmans Stijn",null,"Hofmans Stijn",{"$error":"#N/A"},null,null,"De Groof Maarten",0,2,0,2,4.0000499999999999,null,null,"Coolsaet Joy","Joy Coolsaet"]
["De Clerck Tom","a","a","a","a","a","a",null,null,null,null,null,null,null,null,null,null,null,null,null,null,null,null,null,null,null,null,0,0,0,6,0,0,0,0,0,"De Clerck Tom",{"$f":"IF(SUM(AP12:BO12)=0,\"\",SUM(AP12:BO12))","v":""},"",{"$f":"_xlfn.LET( _xlpm.i, INDEX($AP12:$BO12,1,MAX(1,MATCH($AN$2,$B$4:$AA$4,0))), IF( _xlpm.i = \"\", \"\", _xlpm.i ))","v":0},12,0,0,0,0,0,0,0,0,0,0,0,0,0,0,0,0,0,0,0,0,0,0,0,0,0,0,null,{"$f":"INDEX($AP12:$BO12,1,MAX(1,MATCH($AN$2,$B$4:$AA$4,0)))","v":0},-0.08,7.0128571428571433,null,0,{"$f":"BU12-CC12/100","v":-0.08},26.198095238095242,null,0,{"$f":"1000*BY12+BU12-CC12/100","v":-0.08},35.647385620915031,null,8,null,8,"Glenn De Vinster",7.1428571428571432,{"$f":"IF( CS12 = \"\", \"\", _xlfn.XLOOKUP( CS12, $A$302:$A$334, INDEX( $B$302:$AA$334, , $AM$1 ), \"\" ))","v":5},null,null,null,8,"Wout Beirinckx",26.238095238095241,21,"(5)",5.2476190476190485,null,"De Vinster Glenn","Beirinckx Wout","","Celis Ive",null,"","","","",null,8,"Ive Celis",0,1,1,2,3.0000499999999999,null,null,"De Groof Maarten / Elst Pieter",null,"De Groof Maarten","Elst Pieter",null,null,"Elst Pieter",0,1,0,1,2.0000499999999999,null,null,"De Clerck Tom","Tom De Clerck"]
["De Graeve Robbe",1,1,"a","a","a","a",null,null,null,null,null,null,null,null,null,null,null,null,null,null,null,null,null,null,null,null,0,2,0,4,0,0,0,0,2,"De Graeve Robbe",7.1111111111111107,22,{"$f":"_xlfn.LET( _xlpm.i, INDEX($AP13:$BO13,1,MAX(1,MATCH($AN$2,$B$4:$AA$4,0))), IF( _xlpm.i = \"\", \"\", _xlpm.i ))","v":0},12,4.4444444444444446,2.6666666666666665,0,0,0,0,0,0,0,0,0,0,0,0,0,0,0,0,0,0,0,0,0,0,0,0,null,{"$f":"INDEX($AP13:$BO13,1,MAX(1,MATCH($AN$2,$B$4:$AA$4,0)))","v":0},-0.09,5.5942857142857143,null,{"$f":"SUM(AP13:BO13)","v":7.1111111111111107},{"$f":"BU13-CC13/100","v":7.0211111111111109},23.746507936507935,null,0,{"$f":"1000*BY13+BU13-CC13/100","v":7.0211111111111109},28.738319327731094,null,9,null,9,"Erlend De Swert",5.7142857142857144,{"$f":"IF( CS13 = \"\", \"\", _xlfn.XLOOKUP( CS13, $A$302:$A$334, INDEX( $B$302:$AA$334, , $AM$1 ), \"\" ))","v":4},null,null,null,9,"Koen Jordens",23.936507936507937,19,"(5)",4.7873015873015872,null,"De Swert Erlend","Jordens Koen","","Elst Pieter",null,"","","","",null,9,"Pieter Elst",0,1,0,1,2.0000499999999999,null,null,"De Groof Maarten",null,"De Groof Maarten",{"$error":"#N/A"},null,null,"Celis Ive",0,1,1,2,3.0000499999999999,null,null,"De Graeve Robbe","Robbe De Graeve"]
["De Groof Maarten",1,1,1,1,1,"t",null,null,null,null,null,null,null,null,null,null,null,null,null,null,null,null,null,null,null,null,1,5,0.16666666666666666,0,0,0,1,{"$f":"COUNTIF(B14:AA14,\"k\")","v":0},5,"De Groof Maarten",47.464052287581694,3,{"$f":"_xlfn.LET( _xlpm.i, INDEX($AP14:$BO14,1,MAX(1,MATCH($AN$2,$B$4:$AA$4,0))), IF( _xlpm.i = \"\", \"\", _xlpm.i ))","v":0},12,7.7777777777777777,14.666666666666666,16,6.666666666666667,2.3529411764705883,0,0,0,0,0,0,0,0,0,0,0,0,0,0,0,0,0,0,0,0,0,null,{"$f":"INDEX($AP14:$BO14,1,MAX(1,MATCH($AN$2,$B$4:$AA$4,0)))","v":0},-0.1,5.524285714285714,null,47.464052287581694,47.364052287581693,23.101764705882356,null,0,47.364052287581693,26.198095238095242,null,10,null,10,"Koen Jordens",5.7142857142857144,{"$f":"IF( CS14 = \"\", \"\", _xlfn.XLOOKUP( CS14, $A$302:$A$334, INDEX( $B$302:$AA$334, , $AM$1 ), \"\" ))","v":4},null,null,null,10,"Kaïn Verlooy",23.411764705882355,21,"(3)",7.8039215686274517,null,"Jordens Koen","Verlooy Kaïn","","De Groof Steven",null,"","","","",null,10,"Steven De Groof",0,1,0,1,2.0000499999999999,null,null,"Nyckees Wannes",null,"Nyckees Wannes",{"$error":"#N/A"},null,null,"De Groof Steven",0,1,0,1,2.0000499999999999,null,null,"De Groof Maarten","Maarten De Groof"]
["De Groof Steven",1,"b","p",1,1,1,null,null,null,null,null,null,null,null,null,null,null,null,null,null,null,null,null,null,null,null,0,4,0,0,1,0,1,0,3,"De Groof Steven",15.079365079365079,16,{"$f":"_xlfn.LET( _xlpm.i, INDEX($AP15:$BO15,1,MAX(1,MATCH($AN$2,$B$4:$AA$4,0))), IF( _xlpm.i = \"\", \"\", _xlpm.i ))","v":12.857142857142858},2,2.2222222222222223,0,0,0,0,12.857142857142858,0,0,0,0,0,0,0,0,0,0,0,0,0,0,0,0,0,0,0,0,null,{"$f":"INDEX($AP15:$BO15,1,MAX(1,MATCH($AN$2,$B$4:$AA$4,0)))","v":12.857142857142858},12.747142857142858,4.0157142857142851,null,15.079365079365079,14.96936507936508,21.518982259570496,null,0,14.96936507936508,23.746507936507935,null,11,null,11,"Dieter Van Dessel",4.2857142857142856,{"$f":"IF( CS15 = \"\", \"\", _xlfn.XLOOKUP( CS15, $A$302:$A$334, INDEX( $B$302:$AA$334, , $AM$1 ), \"\" ))","v":3},null,null,null,11,"Dieter Van Dessel",21.788982259570496,18,"(5)",4.3577964519140995,null,"Van Dessel Dieter","Van Dessel Dieter","","Jordens Koen",null,"","","","",null,11,"Koen Jordens",0,0,1,1,1.0000500000000001,null,null,"Hofmans Stijn",null,"Hofmans Stijn",{"$error":"#N/A"},null,null,"Jordens Koen",0,0,1,1,1.0000500000000001,null,null,"De Groof Steven","Steven De Groof"]
["De Swert Erlend","a",1,"a","a","a",1,null,null,null,null,null,null,null,null,null,null,null,null,null,null,null,null,null,null,null,null,0,2,0,4,0,0,0,0,1,"De Swert Erlend",12.380952380952381,17,{"$f":"_xlfn.LET( _xlpm.i, INDEX($AP16:$BO16,1,MAX(1,MATCH($AN$2,$B$4:$AA$4,0))), IF( _xlpm.i = \"\", \"\", _xlpm.i ))","v":5.7142857142857144},9,0,6.666666666666667,0,0,0,5.7142857142857144,0,0,0,0,0,0,0,0,0,0,0,0,0,0,0,0,0,0,0,0,null,{"$f":"INDEX($AP16:$BO16,1,MAX(1,MATCH($AN$2,$B$4:$AA$4,0)))","v":5.7142857142857144},5.5942857142857143,-0.01,null,12.380952380952381,12.260952380952382,20.263333333333335,null,0,12.260952380952382,23.101764705882356,null,12,null,"","","",{"$f":"IF( CS16 = \"\", \"\", _xlfn.XLOOKUP( CS16, $A$302:$A$334, INDEX( $B$302:$AA$334, , $AM$1 ), \"\" ))","v":""},null,null,null,12,"Joy Coolsaet",20.333333333333336,15,"(2)",10.166666666666668,null,"","Coolsaet Joy","","Stevens Siebe",null,"","","","",null,12,"Siebe Stevens",0,0,1,1,1.0000500000000001,null,null,"Celis Ive / De Groof Steven",null,"Celis Ive","De Groof Steven",null,null,"Stevens Siebe",0,0,1,1,1.0000500000000001,null,null,"De Swert Erlend","Erlend De Swert"]
["De Vinster Glenn",1,1,1,"a",1,1,null,null,null,null,null,null,null,null,null,null,null,null,null,null,null,null,null,null,null,null,1,5,0.16666666666666666,1,0,0,0,0,4,"De Vinster Glenn",56.744164332399627,2,{"$f":"_xlfn.LET( _xlpm.i, INDEX($AP17:$BO17,1,MAX(1,MATCH($AN$2,$B$4:$AA$4,0))), IF( _xlpm.i = \"\", \"\", _xlpm.i ))","v":7.1428571428571432},8,7.7777777777777777,16,7,0,18.823529411764707,7.1428571428571432,0,0,0,0,0,0,0,0,0,0,0,0,0,0,0,0,0,0,0,0,null,{"$f":"INDEX($AP17:$BO17,1,MAX(1,MATCH($AN$2,$B$4:$AA$4,0)))","v":7.1428571428571432},7.0128571428571433,-0.02,null,56.744164332399627,56.614164332399625,19.86,null,2,2056.6141643323995,21.518982259570496,null,13,null,"","","",{"$f":"IF( CS17 = \"\", \"\", _xlfn.XLOOKUP( CS17, $A$302:$A$334, INDEX( $B$302:$AA$334, , $AM$1 ), \"\" ))","v":""},null,null,null,13,"Robbe Delen",20,20,"(1)",20,null,"","Delen Robbe","","Coolsaet Joy",null,"","","","",null,13,"Joy Coolsaet",0,0,1,1,1.0000500000000001,null,null,"Langenaeker Maarten",null,"Langenaeker Maarten",{"$error":"#N/A"},null,null,"Coolsaet Joy",0,0,1,1,1.0000500000000001,null,null,"De Vinster Glenn","Glenn De Vinster"]
["Delen Robbe","na","a",1,"a","a","a",null,null,null,null,null,null,null,null,null,null,null,null,null,null,null,null,null,null,null,null,0,{"$f":"COUNTIF( B18:AA18, \"k\" ) + SUM( B18:AA18 )","v":1},{"$f":"IFERROR( AB18 / COUNT($B$4:$AA$4), \"\" )","v":0},{"$f":"COUNTIF( B18:AA18, \"a\" )","v":4},{"$f":"COUNTIF( B18:AA18, \"b\" )","v":0},{"$f":"COUNTIF( B18:AA18, \"s\" )","v":0},{"$f":"COUNTIF( B18:AA18, \"ng\" ) + COUNTIF( B18:AA18, \"na\" ) + COUNTIF( B18:AA18, \"p\" ) + COUNTIF( B18:AA18, \"t\" )","v":1},{"$f":"COUNTIF(B18:AA18,\"k\")","v":0},1,"Delen Robbe",20,13,{"$f":"_xlfn.LET( _xlpm.i, INDEX($AP18:$BO18,1,MAX(1,MATCH($AN$2,$B$4:$AA$4,0))), IF( _xlpm.i = \"\", \"\", _xlpm.i ))","v":0},12,0,0,20,0,0,0,0,0,0,0,0,0,0,0,0,0,0,0,0,0,0,0,0,0,0,0,null,{"$f":"INDEX($AP18:$BO18,1,MAX(1,MATCH($AN$2,$B$4:$AA$4,0)))","v":0},-0.14000000000000001,-0.03,null,{"$f":"SUM(AP18:BO18)","v":20},{"$f":"BU18-CC18/100","v":19.86},18.854761904761904,null,1,{"$f":"1000*BY18+BU18-CC18/100","v":1019.86},20.263333333333335,null,14,null,"","","",{"$f":"IF( CS18 = \"\", \"\", _xlfn.XLOOKUP( CS18, $A$302:$A$334, INDEX( $B$302:$AA$334, , $AM$1 ), \"\" ))","v":""},null,null,null,{"$f":"IF(CN18=\"\",\"\",CC18)","v":14},"Dieuwer Boes",18.904761904761905,14,"(5)",{"$f":"IFERROR(IF(CN18=\"\",\"\",ABS(CN18/CP18)),0)","v":3.7809523809523808},null,"","Boes Dieuwer","",null,null,{"$f":"IF(CZ18=\"\",\"\",CC18)","v":""},"","","",null,null,null,null,null,null,null,null,null,null,"Jordens Koen",null,"Jordens Koen",{"$error":"#N/A"},null,null,null,null,null,null,null,null,null,null,"Delen Robbe","Robbe Delen"]
["Elst Pieter",1,1,1,"a",1,"a",null,null,null,null,null,null,null,null,null,null,null,null,null,null,null,null,null,null,null,null,0,4,0,2,0,0,0,0,4,"Elst Pieter",35.79738562091503,6,{"$f":"_xlfn.LET( _xlpm.i, INDEX($AP19:$BO19,1,MAX(1,MATCH($AN$2,$B$4:$AA$4,0))), IF( _xlpm.i = \"\", \"\", _xlpm.i ))","v":0},12,7.7777777777777777,14.666666666666666,11,0,2.3529411764705883,0,0,0,0,0,0,0,0,0,0,0,0,0,0,0,0,0,0,0,0,0,null,{"$f":"INDEX($AP19:$BO19,1,MAX(1,MATCH($AN$2,$B$4:$AA$4,0)))","v":0},-0.15,-0.08,null,35.79738562091503,35.647385620915031,16.125714285714285,null,0,35.647385620915031,18.854761904761904,null,15,null,"","","",{"$f":"IF( CS19 = \"\", \"\", _xlfn.XLOOKUP( CS19, $A$302:$A$334, INDEX( $B$302:$AA$334, , $AM$1 ), \"\" ))","v":""},null,null,null,15,"Bernd Gielis",16.285714285714285,12,"(2)",8.1428571428571423,null,"","Gielis Bernd","",null,null,"","","","",null,null,null,null,null,null,null,null,null,null,"Langenaeker Maarten",null,"Langenaeker Maarten",{"$error":"#N/A"},null,null,null,null,null,null,null,null,null,null,"Elst Pieter","Pieter Elst"]
["Gielis Bernd","a","a",1,"b","b",1,null,null,null,null,null,null,null,null,null,null,null,null,null,null,null,null,null,null,null,null,0,2,0,2,2,0,0,0,1,"Gielis Bernd",16.285714285714285,15,{"$f":"_xlfn.LET( _xlpm.i, INDEX($AP20:$BO20,1,MAX(1,MATCH($AN$2,$B$4:$AA$4,0))), IF( _xlpm.i = \"\", \"\", _xlpm.i ))","v":14.285714285714286},1,0,0,2,0,0,14.285714285714286,0,0,0,0,0,0,0,0,0,0,0,0,0,0,0,0,0,0,0,0,null,{"$f":"INDEX($AP20:$BO20,1,MAX(1,MATCH($AN$2,$B$4:$AA$4,0)))","v":14.285714285714286},14.125714285714286,-0.09,null,16.285714285714285,16.125714285714285,14.96936507936508,null,1,1016.1257142857144,14.96936507936508,null,16,null,"","","",{"$f":"IF( CS20 = \"\", \"\", _xlfn.XLOOKUP( CS20, $A$302:$A$334, INDEX( $B$302:$AA$334, , $AM$1 ), \"\" ))","v":""},null,null,null,16,"Steven De Groof",15.079365079365079,11,"(4)",3.7698412698412698,null,"","De Groof Steven","",null,null,"","","","",null,null,null,null,null,null,null,null,null,null,"Stevens Siebe",null,"Stevens Siebe",{"$error":"#N/A"},null,null,null,null,null,null,null,null,null,null,"Gielis Bernd","Bernd Gielis"]
["Gielis Wim",1,1,1,1,"b",1,null,null,null,null,null,null,null,null,null,null,null,null,null,null,null,null,null,null,null,null,0,5,0,0,1,0,0,0,4,"Gielis Wim",5,23,{"$f":"_xlfn.LET( _xlpm.i, INDEX($AP21:$BO21,1,MAX(1,MATCH($AN$2,$B$4:$AA$4,0))), IF( _xlpm.i = \"\", \"\", _xlpm.i ))","v":0},12,0,4,1,0,0,0,0,0,0,0,0,0,0,0,0,0,0,0,0,0,0,0,0,0,0,0,null,{"$f":"INDEX($AP21:$BO21,1,MAX(1,MATCH($AN$2,$B$4:$AA$4,0)))","v":0},-0.17,-0.1,null,{"$f":"SUM(AP21:BO21)","v":5},{"$f":"BU21-CC21/100","v":4.83},12.260952380952382,null,0,{"$f":"1000*BY21+BU21-CC21/100","v":4.83},12.260952380952382,null,17,null,{"$f":"IF(CG21=\"\",\"\",CC21)","v":""},"","",{"$f":"IF( CS21 = \"\", \"\", _xlfn.XLOOKUP( CS21, $A$302:$A$334, INDEX( $B$302:$AA$334, , $AM$1 ), \"\" ))","v":""},null,null,null,{"$f":"IF(CN21=\"\",\"\",CC21)","v":17},"Erlend De Swert",12.380952380952381,9,"(2)",{"$f":"IFERROR(IF(CN21=\"\",\"\",ABS(CN21/CP21)),0)","v":6.1904761904761907},null,"","De Swert Erlend","",null,null,"","","","",null,null,null,null,null,null,null,null,null,null,"Celis Ive",null,"Celis Ive",{"$error":"#N/A"},null,null,null,null,null,null,null,null,null,null,"Gielis Wim","Wim Gielis"]
["Hofmans Stijn",1,1,1,"a",1,"a",null,null,null,null,null,null,null,null,null,null,null,null,null,null,null,null,null,null,null,null,3,{"$f":"COUNTIF( B22:AA22, \"k\" ) + SUM( B22:AA22 )","v":4},{"$f":"IFERROR( AB22 / COUNT($B$4:$AA$4), \"\" )","v":0.5},{"$f":"COUNTIF( B22:AA22, \"a\" )","v":2},{"$f":"COUNTIF( B22:AA22, \"b\" )","v":0},{"$f":"COUNTIF( B22:AA22, \"s\" )","v":0},{"$f":"COUNTIF( B22:AA22, \"ng\" ) + COUNTIF( B22:AA22, \"na\" ) + COUNTIF( B22:AA22, \"p\" ) + COUNTIF( B22:AA22, \"t\" )","v":0},{"$f":"COUNTIF(B22:AA22,\"k\")","v":0},4,"Hofmans Stijn",{"$f":"IF(SUM(AP22:BO22)=0,\"\",SUM(AP22:BO22))","v":40.803921568627452},4,{"$f":"_xlfn.LET( _xlpm.i, INDEX($AP22:$BO22,1,MAX(1,MATCH($AN$2,$B$4:$AA$4,0))), IF( _xlpm.i = \"\", \"\", _xlpm.i ))","v":0},12,13.333333333333334,8,3,0,16.470588235294116,0,0,0,0,0,0,0,0,0,0,0,0,0,0,0,0,0,0,0,0,0,null,{"$f":"INDEX($AP22:$BO22,1,MAX(1,MATCH($AN$2,$B$4:$AA$4,0)))","v":0},-0.18,-0.14000000000000001,null,40.803921568627452,40.623921568627452,11.77,null,0,40.623921568627452,11.77,null,18,null,"","","",{"$f":"IF( CS22 = \"\", \"\", _xlfn.XLOOKUP( CS22, $A$302:$A$334, INDEX( $B$302:$AA$334, , $AM$1 ), \"\" ))","v":""},null,null,null,18,"Siebe Stevens",12,9,"(1)",12,null,"","Stevens Siebe","",null,null,null,null,null,null,null,null,null,null,null,null,null,null,null,null,"Coolsaet Joy / Langenaeker Maarten",null,"Coolsaet Joy","Langenaeker Maarten",null,null,null,null,null,null,null,null,null,null,"Hofmans Stijn","Stijn Hofmans"]
["Jordens Koen",1,1,1,"a",1,1,null,null,null,null,null,null,null,null,null,null,null,null,null,null,null,null,null,null,null,null,0,5,0,1,0,0,0,0,4,"Jordens Koen",23.936507936507937,9,{"$f":"_xlfn.LET( _xlpm.i, INDEX($AP23:$BO23,1,MAX(1,MATCH($AN$2,$B$4:$AA$4,0))), IF( _xlpm.i = \"\", \"\", _xlpm.i ))","v":5.7142857142857144},9,5.5555555555555554,10.666666666666666,2,0,0,5.7142857142857144,0,0,0,0,0,0,0,0,0,0,0,0,0,0,0,0,0,0,0,0,null,{"$f":"INDEX($AP23:$BO23,1,MAX(1,MATCH($AN$2,$B$4:$AA$4,0)))","v":5.7142857142857144},5.524285714285714,-0.15,null,23.936507936507937,23.746507936507935,10.932222222222222,null,0,23.746507936507935,10.932222222222222,null,19,null,"","","",{"$f":"IF( CS23 = \"\", \"\", _xlfn.XLOOKUP( CS23, $A$302:$A$334, INDEX( $B$302:$AA$334, , $AM$1 ), \"\" ))","v":""},null,null,null,19,"Stijn Verdickt",11.222222222222221,9,"(4)",2.8055555555555554,null,"","Verdickt Stijn","",null,null,null,null,null,null,null,null,null,null,null,null,null,null,null,null,null,null,null,null,null,null,null,null,null,null,null,null,null,null,"Jordens Koen","Koen Jordens"]
["Langenaeker Maarten","k","k","k","k","k","k",null,null,null,null,null,null,null,null,null,null,null,null,null,null,null,null,null,null,null,null,0,6,0,0,0,0,0,6,0,"Langenaeker Maarten",60.241830065359473,1,{"$f":"_xlfn.LET( _xlpm.i, INDEX($AP24:$BO24,1,MAX(1,MATCH($AN$2,$B$4:$AA$4,0))), IF( _xlpm.i = \"\", \"\", _xlpm.i ))","v":10},4,12.222222222222221,2.6666666666666665,13,20,2.3529411764705883,10,0,0,0,0,0,0,0,0,0,0,0,0,0,0,0,0,0,0,0,0,null,{"$f":"INDEX($AP24:$BO24,1,MAX(1,MATCH($AN$2,$B$4:$AA$4,0)))","v":10},9.8000000000000007,-0.17,null,60.241830065359473,60.04183006535947,9.1517647058823535,null,1,1060.0418300653594,9.1517647058823535,null,20,null,"","","",{"$f":"IF( CS24 = \"\", \"\", _xlfn.XLOOKUP( CS24, $A$302:$A$334, INDEX( $B$302:$AA$334, , $AM$1 ), \"\" ))","v":""},null,null,null,20,"Brent Van Den Brande",9.4117647058823533,8,"(1)",9.4117647058823533,null,"","Van Den Brande Brent","",null,null,null,null,null,null,null,null,null,null,null,null,null,null,null,null,null,null,null,null,null,null,null,null,null,null,null,null,null,null,"Langenaeker Maarten","Maarten Langenaeker"]
["Lenaerts Jordy","a","a","a","a","a","a",null,null,null,null,null,null,null,null,null,null,null,null,null,null,null,null,null,null,null,null,{"$f":"SUM( B124:AA124 )","v":0},0,0,6,0,0,0,0,0,"Lenaerts Jordy","","",{"$f":"_xlfn.LET( _xlpm.i, INDEX($AP25:$BO25,1,MAX(1,MATCH($AN$2,$B$4:$AA$4,0))), IF( _xlpm.i = \"\", \"\", _xlpm.i ))","v":0},12,0,0,0,0,0,0,0,0,0,0,0,0,0,0,0,0,0,0,0,0,0,0,0,0,0,0,null,{"$f":"INDEX($AP25:$BO25,1,MAX(1,MATCH($AN$2,$B$4:$AA$4,0)))","v":0},-0.21,-0.18,null,0,-0.21,7.68,null,0,-0.21,7.68,null,21,null,"","","",{"$f":"IF( CS25 = \"\", \"\", _xlfn.XLOOKUP( CS25, $A$302:$A$334, INDEX( $B$302:$AA$334, , $AM$1 ), \"\" ))","v":""},null,null,null,21,"Jason Vermeylen",8,7,"(2)",4,null,"","Vermeylen Jason","",null,null,null,null,null,null,null,null,null,null,null,null,null,null,null,null,null,null,null,null,null,null,null,null,null,null,null,null,null,null,"Lenaerts Jordy","Jordy Lenaerts"]
["Nyckees Wannes",1,"b","a",1,"a","a",null,null,null,null,null,null,null,null,null,null,null,null,null,null,null,null,null,null,null,null,0,2,0,3,1,0,0,0,2,"Nyckees Wannes",38.222222222222221,5,{"$f":"_xlfn.LET( _xlpm.i, INDEX($AP26:$BO26,1,MAX(1,MATCH($AN$2,$B$4:$AA$4,0))), IF( _xlpm.i = \"\", \"\", _xlpm.i ))","v":0},12,22.222222222222221,0,0,16,0,0,0,0,0,0,0,0,0,0,0,0,0,0,0,0,0,0,0,0,0,0,null,{"$f":"INDEX($AP26:$BO26,1,MAX(1,MATCH($AN$2,$B$4:$AA$4,0)))","v":0},-0.22,-0.21,null,38.222222222222221,38.002222222222223,7.0211111111111109,null,1,1038.0022222222221,7.0211111111111109,null,22,null,"","","",{"$f":"IF( CS26 = \"\", \"\", _xlfn.XLOOKUP( CS26, $A$302:$A$334, INDEX( $B$302:$AA$334, , $AM$1 ), \"\" ))","v":""},null,null,null,22,"Robbe De Graeve",7.1111111111111107,6,"(2)",3.5555555555555554,null,"","De Graeve Robbe","",null,null,null,null,null,null,null,null,null,null,null,null,null,null,null,null,null,null,null,null,null,null,null,null,null,null,null,null,null,null,"Nyckees Wannes","Wannes Nyckees"]
["Stevens Siebe","b","b","b",1,"a","a",null,null,null,null,null,null,null,null,null,null,null,null,null,null,null,null,null,null,null,null,0,1,0,2,3,0,0,0,1,"Stevens Siebe",12,18,{"$f":"_xlfn.LET( _xlpm.i, INDEX($AP27:$BO27,1,MAX(1,MATCH($AN$2,$B$4:$AA$4,0))), IF( _xlpm.i = \"\", \"\", _xlpm.i ))","v":0},12,0,0,0,12,0,0,0,0,0,0,0,0,0,0,0,0,0,0,0,0,0,0,0,0,0,0,null,{"$f":"INDEX($AP27:$BO27,1,MAX(1,MATCH($AN$2,$B$4:$AA$4,0)))","v":0},-0.23,-0.22,null,12,11.77,4.83,null,0,11.77,4.83,null,23,null,"","","",{"$f":"IF( CS27 = \"\", \"\", _xlfn.XLOOKUP( CS27, $A$302:$A$334, INDEX( $B$302:$AA$334, , $AM$1 ), \"\" ))","v":""},null,null,null,23,"Wim Gielis",5,4,"(5)",1,null,"","Gielis Wim","",null,null,"",{"$f":"_xlfn.XLOOKUP( CU27, $DZ$5:$DZ$37, $EA$5:$EA$37, \"\" )","v":""},{"$f":"IF(INDEX($BY$5:$BY$38,MATCH(CA27,$BZ$5:$BZ$38,0))=0,\"\",INDEX($BY$5:$BY$38,MATCH(CA27,$BZ$5:$BZ$38,0)))","v":""},{"$f":"IF(CZ27=\"\",\"\",\"(\" & INDEX($AC$5:$AC$38,MATCH(CU27,$AK$5:$AK$38,0)) & \")\")","v":""},null,null,null,null,null,null,null,null,null,null,null,null,null,null,null,null,null,null,null,null,null,null,null,null,"Stevens Siebe","Siebe Stevens"]
["Tielemans Tom","a","a","a","a","a","a",null,null,null,null,null,null,null,null,null,null,null,null,null,null,null,null,null,null,null,null,0,0,0,6,0,0,0,{"$f":"COUNTIF(B28:AA28,\"k\")","v":0},0,"Tielemans Tom","","",{"$f":"_xlfn.LET( _xlpm.i, INDEX($AP28:$BO28,1,MAX(1,MATCH($AN$2,$B$4:$AA$4,0))), IF( _xlpm.i = \"\", \"\", _xlpm.i ))","v":0},12,0,0,0,0,0,0,0,0,0,0,0,0,0,0,0,0,0,0,0,0,0,0,0,0,0,0,null,{"$f":"INDEX($AP28:$BO28,1,MAX(1,MATCH($AN$2,$B$4:$AA$4,0)))","v":0},-0.24,-0.23,null,0,{"$f":"BU28-CC28/100","v":-0.24},2.1922222222222225,null,0,{"$f":"1000*BY28+BU28-CC28/100","v":-0.24},2.1922222222222225,null,24,null,"","","",{"$f":"IF( CS28 = \"\", \"\", _xlfn.XLOOKUP( CS28, $A$302:$A$334, INDEX( $B$302:$AA$334, , $AM$1 ), \"\" ))","v":""},null,null,null,24,"Jurgen Beirinckx",2.2222222222222223,2,"(2)",1.1111111111111112,null,"","Beirinckx Jurgen","",null,null,"",null,"","",null,null,null,null,null,null,null,null,null,null,null,null,null,null,null,null,null,null,null,null,null,null,null,null,"Tielemans Tom","Tom Tielemans"]
["Van de Vondel Rob","b","b","b","b","b","b",null,null,null,null,null,null,null,null,null,null,null,null,null,null,null,null,null,null,null,null,0,0,0,0,6,0,0,0,0,"Van de Vondel Rob","","",{"$f":"_xlfn.LET( _xlpm.i, INDEX($AP29:$BO29,1,MAX(1,MATCH($AN$2,$B$4:$AA$4,0))), IF( _xlpm.i = \"\", \"\", _xlpm.i ))","v":0},12,0,0,0,0,0,0,0,0,0,0,0,0,0,0,0,0,0,0,0,0,0,0,0,0,0,0,null,{"$f":"INDEX($AP29:$BO29,1,MAX(1,MATCH($AN$2,$B$4:$AA$4,0)))","v":0},-0.25,-0.24,null,0,{"$f":"BU29-CC29/100","v":-0.25},-0.01,null,0,{"$f":"1000*BY29+BU29-CC29/100","v":-0.25},-0.01,null,25,null,"","","",{"$f":"IF( CS29 = \"\", \"\", _xlfn.XLOOKUP( CS29, $A$302:$A$334, INDEX( $B$302:$AA$334, , $AM$1 ), \"\" ))","v":""},null,null,null,"","","","","","",null,"","","",null,null,"",{"$f":"_xlfn.XLOOKUP( CU29, $DZ$5:$DZ$37, $EA$5:$EA$37, \"\" )","v":""},"","",null,null,null,null,null,null,null,null,null,null,null,null,null,null,null,null,null,null,null,null,null,null,null,null,"Van de Vondel Rob","Rob Van de Vondel"]
["Van Den Brande Brent","ng","ng","na","na",1,"a",null,null,null,null,null,null,null,null,null,null,null,null,null,null,null,null,null,null,null,null,0,{"$f":"COUNTIF( B30:AA30, \"k\" ) + SUM( B30:AA30 )","v":1},{"$f":"IFERROR( AB30 / COUNT($B$4:$AA$4), \"\" )","v":0},{"$f":"COUNTIF( B30:AA30, \"a\" )","v":1},{"$f":"COUNTIF( B30:AA30, \"b\" )","v":0},{"$f":"COUNTIF( B30:AA30, \"s\" )","v":0},{"$f":"COUNTIF( B30:AA30, \"ng\" ) + COUNTIF( B30:AA30, \"na\" ) + COUNTIF( B30:AA30, \"p\" ) + COUNTIF( B30:AA30, \"t\" )","v":4},{"$f":"COUNTIF(B30:AA30,\"k\")","v":0},1,"Van Den Brande Brent",{"$f":"IF(SUM(AP30:BO30)=0,\"\",SUM(AP30:BO30))","v":9.4117647058823533},20,{"$f":"_xlfn.LET( _xlpm.i, INDEX($AP30:$BO30,1,MAX(1,MATCH($AN$2,$B$4:$AA$4,0))), IF( _xlpm.i = \"\", \"\", _xlpm.i ))","v":0},12,0,0,0,0,9.4117647058823533,0,0,0,0,0,0,0,0,0,0,0,0,0,0,0,0,0,0,0,0,0,null,{"$f":"INDEX($AP30:$BO30,1,MAX(1,MATCH($AN$2,$B$4:$AA$4,0)))","v":0},-0.26,-0.25,null,{"$f":"SUM(AP30:BO30)","v":9.4117647058823533},{"$f":"BU30-CC30/100","v":9.1517647058823535},-0.02,null,0,{"$f":"1000*BY30+BU30-CC30/100","v":9.1517647058823535},-0.02,null,26,null,{"$f":"IF(CG30=\"\",\"\",CC30)","v":""},"","",{"$f":"IF( CS30 = \"\", \"\", _xlfn.XLOOKUP( CS30, $A$302:$A$334, INDEX( $B$302:$AA$334, , $AM$1 ), \"\" ))","v":""},null,null,null,{"$f":"IF(CN30=\"\",\"\",CC30)","v":""},"","","","",{"$f":"IFERROR(IF(CN30=\"\",\"\",ABS(CN30/CP30)),0)","v":""},null,"","","",null,null,{"$f":"IF(CZ30=\"\",\"\",CC30)","v":""},"","","",null,null,null,null,null,null,null,null,null,null,null,null,null,null,null,null,null,null,null,null,null,null,null,null,"Van Den Brande Brent","Brent Van Den Brande"]
["Van Dessel Dieter",1,1,1,"a",1,1,null,null,null,null,null,null,null,null,null,null,null,null,null,null,null,null,null,null,null,null,{"$f":"SUM( B129:AA129 )","v":0},{"$f":"COUNTIF( B31:AA31, \"k\" ) + SUM( B31:AA31 )","v":5},{"$f":"IFERROR( AB31 / COUNT($B$4:$AA$4), \"\" )","v":0},{"$f":"COUNTIF( B31:AA31, \"a\" )","v":1},{"$f":"COUNTIF( B31:AA31, \"b\" )","v":0},0,0,0,4,"Van Dessel Dieter",21.788982259570496,11,{"$f":"_xlfn.LET( _xlpm.i, INDEX($AP31:$BO31,1,MAX(1,MATCH($AN$2,$B$4:$AA$4,0))), IF( _xlpm.i = \"\", \"\", _xlpm.i ))","v":4.2857142857142856},11,4.4444444444444446,4,2,0,7.0588235294117645,4.2857142857142856,0,0,0,0,0,0,0,0,0,0,0,0,0,0,0,0,0,0,0,0,null,{"$f":"INDEX($AP31:$BO31,1,MAX(1,MATCH($AN$2,$B$4:$AA$4,0)))","v":4.2857142857142856},4.0157142857142851,-0.26,null,21.788982259570496,{"$f":"BU31-CC31/100","v":21.518982259570496},-0.08,null,0,{"$f":"1000*BY31+BU31-CC31/100","v":21.518982259570496},-0.08,null,27,null,"","","",{"$f":"IF( CS31 = \"\", \"\", _xlfn.XLOOKUP( CS31, $A$302:$A$334, INDEX( $B$302:$AA$334, , $AM$1 ), \"\" ))","v":""},null,null,null,"","","","","","",null,"","","",null,null,"","","","",null,null,null,null,null,null,null,null,null,null,null,null,null,null,null,null,null,null,null,null,null,null,null,null,"Van Dessel Dieter","Dieter Van Dessel"]
["Van Gehuchten Vincent","a","a","a","b","b","b",null,null,null,null,null,null,null,null,null,null,null,null,null,null,null,null,null,null,null,null,{"$f":"SUM( B130:AA130 )","v":0},0,0,3,3,0,0,0,0,"Van Gehuchten Vincent","","",{"$f":"_xlfn.LET( _xlpm.i, INDEX($AP32:$BO32,1,MAX(1,MATCH($AN$2,$B$4:$AA$4,0))), IF( _xlpm.i = \"\", \"\", _xlpm.i ))","v":0},12,0,0,0,0,0,0,0,0,0,0,0,0,0,0,0,0,0,0,0,0,0,0,0,0,0,0,null,{"$f":"INDEX($AP32:$BO32,1,MAX(1,MATCH($AN$2,$B$4:$AA$4,0)))","v":0},-0.28000000000000003,-0.28000000000000003,null,0,-0.28000000000000003,-0.21,null,0,-0.28000000000000003,-0.21,null,28,null,"","","",{"$f":"IF( CS32 = \"\", \"\", _xlfn.XLOOKUP( CS32, $A$302:$A$334, INDEX( $B$302:$AA$334, , $AM$1 ), \"\" ))","v":""},null,null,null,"","","","","","",null,"","","",null,null,"","","","",null,null,null,null,null,null,null,null,null,null,null,null,null,null,null,null,null,null,null,null,null,null,null,null,"Van Gehuchten Vincent","Vincent Van Gehuchten"]
["Verdickt Stijn",1,"a",1,1,1,"b",null,null,null,null,null,null,null,null,null,null,null,null,null,null,null,null,null,null,null,null,{"$f":"SUM( B131:AA131 )","v":2},4,0.33333333333333331,1,1,0,0,0,4,"Verdickt Stijn",11.222222222222221,19,{"$f":"_xlfn.LET( _xlpm.i, INDEX($AP33:$BO33,1,MAX(1,MATCH($AN$2,$B$4:$AA$4,0))), IF( _xlpm.i = \"\", \"\", _xlpm.i ))","v":0},12,2.2222222222222223,0,1,8,0,0,0,0,0,0,0,0,0,0,0,0,0,0,0,0,0,0,0,0,0,0,null,{"$f":"INDEX($AP33:$BO33,1,MAX(1,MATCH($AN$2,$B$4:$AA$4,0)))","v":0},-0.28999999999999998,-0.28999999999999998,null,11.222222222222221,10.932222222222222,-0.24,null,0,10.932222222222222,-0.24,null,29,null,"","","",{"$f":"IF( CS33 = \"\", \"\", _xlfn.XLOOKUP( CS33, $A$302:$A$334, INDEX( $B$302:$AA$334, , $AM$1 ), \"\" ))","v":""},null,null,null,"","","","","","",null,"","","",null,null,"","","","",null,null,null,null,null,null,null,null,null,null,null,null,null,null,null,null,null,null,null,null,null,null,null,null,"Verdickt Stijn","Stijn Verdickt"]
["Verhellen Jorn","na","na","na",1,1,"a",null,null,null,null,null,null,null,null,null,null,null,null,null,null,null,null,null,null,null,null,{"$f":"SUM( B132:AA132 )","v":0},{"$f":"COUNTIF( B34:AA34, \"k\" ) + SUM( B34:AA34 )","v":2},{"$f":"IFERROR( AB34 / COUNT($B$4:$AA$4), \"\" )","v":0},{"$f":"COUNTIF( B34:AA34, \"a\" )","v":1},{"$f":"COUNTIF( B34:AA34, \"b\" )","v":0},{"$f":"COUNTIF( B34:AA34, \"s\" )","v":0},{"$f":"COUNTIF( B34:AA34, \"ng\" ) + COUNTIF( B34:AA34, \"na\" ) + COUNTIF( B34:AA34, \"p\" ) + COUNTIF( B34:AA34, \"t\" )","v":3},{"$f":"COUNTIF(B34:AA34,\"k\")","v":0},2,"Verhellen Jorn",{"$f":"IF(SUM(AP34:BO34)=0,\"\",SUM(AP34:BO34))","v":""},"",{"$f":"_xlfn.LET( _xlpm.i, INDEX($AP34:$BO34,1,MAX(1,MATCH($AN$2,$B$4:$AA$4,0))), IF( _xlpm.i = \"\", \"\", _xlpm.i ))","v":0},12,0,0,0,0,0,0,0,0,0,0,0,0,0,0,0,0,0,0,0,0,0,0,0,0,0,0,null,{"$f":"INDEX($AP34:$BO34,1,MAX(1,MATCH($AN$2,$B$4:$AA$4,0)))","v":0},-0.3,-0.3,null,{"$f":"SUM(AP34:BO34)","v":0},{"$f":"BU34-CC34/100","v":-0.3},-0.25,null,0,{"$f":"1000*BY34+BU34-CC34/100","v":-0.3},-0.25,null,30,null,{"$f":"IF(CG34=\"\",\"\",CC34)","v":""},"","",{"$f":"IF( CS34 = \"\", \"\", _xlfn.XLOOKUP( CS34, $A$302:$A$334, INDEX( $B$302:$AA$334, , $AM$1 ), \"\" ))","v":""},null,null,null,{"$f":"IF(CN34=\"\",\"\",CC34)","v":""},"","","","",{"$f":"IFERROR(IF(CN34=\"\",\"\",ABS(CN34/CP34)),0)","v":""},null,"","","",null,null,{"$f":"IF(CZ34=\"\",\"\",CC34)","v":""},"","","",null,null,null,null,null,null,null,null,null,null,null,null,null,null,null,null,null,null,null,null,null,null,null,null,"Verhellen Jorn","Jorn Verhellen"]
["Verlooy Kaïn","a","a",1,1,1,"a",null,null,null,null,null,null,null,null,null,null,null,null,null,null,null,null,null,null,null,null,{"$f":"SUM( B132:AA132 )","v":0},3,0,3,0,0,0,0,3,"Verlooy Kaïn",23.411764705882355,10,{"$f":"_xlfn.LET( _xlpm.i, INDEX($AP35:$BO35,1,MAX(1,MATCH($AN$2,$B$4:$AA$4,0))), IF( _xlpm.i = \"\", \"\", _xlpm.i ))","v":0},12,0,0,10,4,9.4117647058823533,0,0,0,0,0,0,0,0,0,0,0,0,0,0,0,0,0,0,0,0,0,null,{"$f":"INDEX($AP35:$BO35,1,MAX(1,MATCH($AN$2,$B$4:$AA$4,0)))","v":0},-0.31,-0.31,null,23.411764705882355,{"$f":"BU35-CC35/100","v":23.101764705882356},-0.28000000000000003,null,0,{"$f":"1000*BY35+BU35-CC35/100","v":23.101764705882356},-0.28000000000000003,null,31,null,"","","",{"$f":"IF( CS35 = \"\", \"\", _xlfn.XLOOKUP( CS35, $A$302:$A$334, INDEX( $B$302:$AA$334, , $AM$1 ), \"\" ))","v":""},null,null,null,"","","","","","",null,"","","",null,null,"","","","",null,null,null,null,null,null,null,null,null,null,null,null,null,null,null,null,null,null,null,null,null,null,null,null,"Verlooy Kaïn","Kaïn Verlooy"]
["Vermeylen Jason",1,1,"b","b","b","b",null,null,null,null,null,null,null,null,null,null,null,null,null,null,null,null,null,null,null,null,1,2,0.16666666666666666,0,4,0,0,{"$f":"COUNTIF(B36:AA36,\"k\")","v":0},2,"Vermeylen Jason",8,21,{"$f":"_xlfn.LET( _xlpm.i, INDEX($AP36:$BO36,1,MAX(1,MATCH($AN$2,$B$4:$AA$4,0))), IF( _xlpm.i = \"\", \"\", _xlpm.i ))","v":0},12,6.666666666666667,1.3333333333333333,0,0,0,0,0,0,0,0,0,0,0,0,0,0,0,0,0,0,0,0,0,0,0,0,null,{"$f":"INDEX($AP36:$BO36,1,MAX(1,MATCH($AN$2,$B$4:$AA$4,0)))","v":0},-0.32,-0.32,null,8,{"$f":"BU36-CC36/100","v":7.68},-0.3,null,0,{"$f":"1000*BY36+BU36-CC36/100","v":7.68},-0.3,null,32,null,"","","",{"$f":"IF( CS36 = \"\", \"\", _xlfn.XLOOKUP( CS36, $A$302:$A$334, INDEX( $B$302:$AA$334, , $AM$1 ), \"\" ))","v":""},null,null,null,"","","","","","",null,"","","",null,null,"","","","",null,null,null,null,null,null,null,null,null,null,null,null,null,null,null,null,null,null,null,null,null,null,null,null,"Vermeylen Jason","Jason Vermeylen"]
["Own-goals/ff-goals",null,null,null,null,null,null,null,null,null,null,null,null,null,null,null,null,null,null,null,null,null,null,null,null,null,null,{"$f":"SUM( B133:AA133 )","v":1},null,0.16666666666666666,0,0,0,0,0,null,{"$f":"A37","v":"Own-goals/ff-goals"},"","",{"$f":"_xlfn.LET( _xlpm.i, INDEX($AP37:$BO37,1,MAX(1,MATCH($AN$2,$B$4:$AA$4,0))), IF( _xlpm.i = \"\", \"\", _xlpm.i ))","v":0},12,{"$f":"B384","v":0},{"$f":"C384","v":0},{"$f":"D384","v":0},{"$f":"E384","v":0},{"$f":"F384","v":0},{"$f":"G384","v":0},{"$f":"H384","v":0},{"$f":"I384","v":0},{"$f":"J384","v":0},{"$f":"K384","v":0},{"$f":"L384","v":0},{"$f":"M384","v":0},{"$f":"N384","v":0},{"$f":"O384","v":0},{"$f":"P384","v":0},{"$f":"Q384","v":0},{"$f":"R384","v":0},{"$f":"S384","v":0},{"$f":"T384","v":0},{"$f":"U384","v":0},{"$f":"V384","v":0},{"$f":"W384","v":0},{"$f":"X384","v":0},{"$f":"Y384","v":0},{"$f":"Z384","v":0},{"$f":"AA384","v":0},null,{"$f":"INDEX($AP37:$BO37,1,MAX(1,MATCH($AN$2,$B$4:$AA$4,0)))","v":0},-0.33,-0.33,null,{"$f":"SUM(AP37:BO37)","v":0},{"$f":"BU37-CC37/100","v":-0.33},-0.33,null,0,{"$f":"1000*BY37+BU37-CC37/100","v":-0.33},-0.33,null,33,null,{"$f":"IF(CG37=\"\",\"\",CC37)","v":""},{"$f":"_xlfn.XLOOKUP( CS37, $DZ$5:$DZ$37, $EA$5:$EA$37, \"\" )","v":""},{"$f":"IF(INDEX($BQ$5:$BQ$38,MATCH(BS37,$BR$5:$BR$38,0))=0,\"\",INDEX($BQ$5:$BQ$38,MATCH(BS37,$BR$5:$BR$38,0)))","v":""},{"$f":"IF( CS37 = \"\", \"\", _xlfn.XLOOKUP( CS37, $A$302:$A$334, INDEX( $B$302:$AA$334, , $AM$1 ), \"\" ))","v":""},null,null,null,{"$f":"IF(CN37=\"\",\"\",CC37)","v":""},"","","","","",null,"","","",null,null,"","","","",null,null,null,null,null,null,null,null,null,null,null,null,null,null,null,null,null,null,null,null,null,null,null,null,"Own-goals/ff-goals","Own-goals/ff-goals"]
[]
["Legende:"]
[null,null,null,null,null,null,null,null,null,null,null,null,null,null,null,null,null,null,null,null,null,null,null,null,null,null,null,null,null,null,null,null,null,null,null,null,"Niet toegekend",{"$f":"IF(SUM(AP40:BO40)=0,\"\",SUM(AP40:BO40))","v":""},{"$f":"IF(AL40=\"\",\"\",RANK(AL40,AL$5:AL$40))","v":""},{"$f":"IF(INDEX($AP40:$BO40,1,MAX(1,COUNT($B$4:$AA$4)))=0,\"\",INDEX($AP40:$BO40,1,MAX(1,COUNT($B$4:$AA$4))))","v":""},{"$f":"IF(AN40=\"\",\"\",RANK(AN40,AN$5:AN$39))","v":""}]
["Uitleg en afkorting",null,null,null,null,null,null,null,null,null,null,null,null,null,null,null,null,null,null,null,null,null,null,null,null,null,null,null,null,null,null,null,null,null,null,null,"Som",null,null,null,null,{"$f":"SUM( AP5:AP40 )","v":98.8888888888889},100,100,81.333333333333343,81.17647058823529,100.00000000000001,0,0,0,0,0,0,0,0,0,0,0,0,0,0,0,0,0,0,0,0]
["Thuiswedstrijd","T",null,"Aantal doelpunten","Getal (Goals)",null,null,null,null,null,null,null,null,null,null,null,null,null,null,null,null,null,null,null,null,null,null,null,null,null,null,null,null,null,null,null,"Aantal invullers",null,null,null,null,{"$f":"AP41 / 5","v":19.777777777777779},{"$f":"AQ41 / 5","v":20},20,16.266666666666669,16.235294117647058,20.000000000000004,0,0,{"$f":"AX41 / 5","v":0},0,0,0,0,0,0,0,0,0,0,0,0,0,0,0,0,0]
["Uitwedstrijd","U",null,"Aantal assists","Getal (Assists)",null,null,null,null,null,null,null,null,null,null,null,null,null,null,null,null,null,null,null,null,null,null,null,null,null,null,null,null,null,null,null,"Winnaar(s)",null,null,null,null,{"$f":"IF( AP$41 = 0, \"\", _xlfn.TEXTJOIN( \" / \",TRUE,  _xlfn._xlws.FILTER( $AK$5:$AK$39, AP$5:AP$39 = LARGE( _xlfn.UNIQUE( AP$5:AP$39 ), 1 ))))","v":"Nyckees Wannes"},{"$f":"IF( AQ$41 = 0, \"\", _xlfn.TEXTJOIN( \" / \",TRUE,  _xlfn._xlws.FILTER( $AK$5:$AK$39, AQ$5:AQ$39 = LARGE( _xlfn.UNIQUE( AQ$5:AQ$39 ), 1 ))))","v":"De Vinster Glenn"},{"$f":"IF( AR$41 = 0, \"\", _xlfn.TEXTJOIN( \" / \",TRUE,  _xlfn._xlws.FILTER( $AK$5:$AK$39, AR$5:AR$39 = LARGE( _xlfn.UNIQUE( AR$5:AR$39 ), 1 ))))","v":"Delen Robbe"},{"$f":"IF( AS$41 = 0, \"\", _xlfn.TEXTJOIN( \" / \",TRUE,  _xlfn._xlws.FILTER( $AK$5:$AK$39, AS$5:AS$39 = LARGE( _xlfn.UNIQUE( AS$5:AS$39 ), 1 ))))","v":"Langenaeker Maarten"},{"$f":"IF( AT$41 = 0, \"\", _xlfn.TEXTJOIN( \" / \",TRUE,  _xlfn._xlws.FILTER( $AK$5:$AK$39, AT$5:AT$39 = LARGE( _xlfn.UNIQUE( AT$5:AT$39 ), 1 ))))","v":"De Vinster Glenn"},{"$f":"IF( AU$41 = 0, \"\", _xlfn.TEXTJOIN( \" / \",TRUE,  _xlfn._xlws.FILTER( $AK$5:$AK$39, AU$5:AU$39 = LARGE( _xlfn.UNIQUE( AU$5:AU$39 ), 1 ))))","v":"Gielis Bernd"},{"$f":"IF( AV$41 = 0, \"\", _xlfn.TEXTJOIN( \" / \",TRUE,  _xlfn._xlws.FILTER( $AK$5:$AK$39, AV$5:AV$39 = LARGE( _xlfn.UNIQUE( AV$5:AV$39 ), 1 ))))","v":""},{"$f":"IF( AW$41 = 0, \"\", _xlfn.TEXTJOIN( \" / \",TRUE,  _xlfn._xlws.FILTER( $AK$5:$AK$39, AW$5:AW$39 = LARGE( _xlfn.UNIQUE( AW$5:AW$39 ), 1 ))))","v":""},{"$f":"IF( AX$41 = 0, \"\", _xlfn.TEXTJOIN( \" / \",TRUE,  _xlfn._xlws.FILTER( $AK$5:$AK$39, AX$5:AX$39 = LARGE( _xlfn.UNIQUE( AX$5:AX$39 ), 1 ))))","v":""},{"$f":"IF( AY$41 = 0, \"\", _xlfn.TEXTJOIN( \" / \",TRUE,  _xlfn._xlws.FILTER( $AK$5:$AK$39, AY$5:AY$39 = LARGE( _xlfn.UNIQUE( AY$5:AY$39 ), 1 ))))","v":""},{"$f":"IF( AZ$41 = 0, \"\", _xlfn.TEXTJOIN( \" / \",TRUE,  _xlfn._xlws.FILTER( $AK$5:$AK$39, AZ$5:AZ$39 = LARGE( _xlfn.UNIQUE( AZ$5:AZ$39 ), 1 ))))","v":""},{"$f":"IF( BA$41 = 0, \"\", _xlfn.TEXTJOIN( \" / \",TRUE,  _xlfn._xlws.FILTER( $AK$5:$AK$39, BA$5:BA$39 = LARGE( _xlfn.UNIQUE( BA$5:BA$39 ), 1 ))))","v":""},{"$f":"IF( BB$41 = 0, \"\", _xlfn.TEXTJOIN( \" / \",TRUE,  _xlfn._xlws.FILTER( $AK$5:$AK$39, BB$5:BB$39 = LARGE( _xlfn.UNIQUE( BB$5:BB$39 ), 1 ))))","v":""},{"$f":"IF( BC$41 = 0, \"\", _xlfn.TEXTJOIN( \" / \",TRUE,  _xlfn._xlws.FILTER( $AK$5:$AK$39, BC$5:BC$39 = LARGE( _xlfn.UNIQUE( BC$5:BC$39 ), 1 ))))","v":""},{"$f":"IF( BD$41 = 0, \"\", _xlfn.TEXTJOIN( \" / \",TRUE,  _xlfn._xlws.FILTER( $AK$5:$AK$39, BD$5:BD$39 = LARGE( _xlfn.UNIQUE( BD$5:BD$39 ), 1 ))))","v":""},{"$f":"IF( BE$41 = 0, \"\", _xlfn.TEXTJOIN( \" / \",TRUE,  _xlfn._xlws.FILTER( $AK$5:$AK$39, BE$5:BE$39 = LARGE( _xlfn.UNIQUE( BE$5:BE$39 ), 1 ))))","v":""},{"$f":"IF( BF$41 = 0, \"\", _xlfn.TEXTJOIN( \" / \",TRUE,  _xlfn._xlws.FILTER( $AK$5:$AK$39, BF$5:BF$39 = LARGE( _xlfn.UNIQUE( BF$5:BF$39 ), 1 ))))","v":""},{"$f":"IF( BG$41 = 0, \"\", _xlfn.TEXTJOIN( \" / \",TRUE,  _xlfn._xlws.FILTER( $AK$5:$AK$39, BG$5:BG$39 = LARGE( _xlfn.UNIQUE( BG$5:BG$39 ), 1 ))))","v":""},{"$f":"IF( BH$41 = 0, \"\", _xlfn.TEXTJOIN( \" / \",TRUE,  _xlfn._xlws.FILTER( $AK$5:$AK$39, BH$5:BH$39 = LARGE( _xlfn.UNIQUE( BH$5:BH$39 ), 1 ))))","v":""},{"$f":"IF( BI$41 = 0, \"\", _xlfn.TEXTJOIN( \" / \",TRUE,  _xlfn._xlws.FILTER( $AK$5:$AK$39, BI$5:BI$39 = LARGE( _xlfn.UNIQUE( BI$5:BI$39 ), 1 ))))","v":""},{"$f":"IF( BJ$41 = 0, \"\", _xlfn.TEXTJOIN( \" / \",TRUE,  _xlfn._xlws.FILTER( $AK$5:$AK$39, BJ$5:BJ$39 = LARGE( _xlfn.UNIQUE( BJ$5:BJ$39 ), 1 ))))","v":""},{"$f":"IF( BK$41 = 0, \"\", _xlfn.TEXTJOIN( \" / \",TRUE,  _xlfn._xlws.FILTER( $AK$5:$AK$39, BK$5:BK$39 = LARGE( _xlfn.UNIQUE( BK$5:BK$39 ), 1 ))))","v":""},{"$f":"IF( BL$41 = 0, \"\", _xlfn.TEXTJOIN( \" / \",TRUE,  _xlfn._xlws.FILTER( $AK$5:$AK$39, BL$5:BL$39 = LARGE( _xlfn.UNIQUE( BL$5:BL$39 ), 1 ))))","v":""},{"$f":"IF( BM$41 = 0, \"\", _xlfn.TEXTJOIN( \" / \",TRUE,  _xlfn._xlws.FILTER( $AK$5:$AK$39, BM$5:BM$39 = LARGE( _xlfn.UNIQUE( BM$5:BM$39 ), 1 ))))","v":""},{"$f":"IF( BN$41 = 0, \"\", _xlfn.TEXTJOIN( \" / \",TRUE,  _xlfn._xlws.FILTER( $AK$5:$AK$39, BN$5:BN$39 = LARGE( _xlfn.UNIQUE( BN$5:BN$39 ), 1 ))))","v":""},{"$f":"IF( BO$41 = 0, \"\", _xlfn.TEXTJOIN( \" / \",TRUE,  _xlfn._xlws.FILTER( $AK$5:$AK$39, BO$5:BO$39 = LARGE( _xlfn.UNIQUE( BO$5:BO$39 ), 1 ))))","v":""}]
["Aanwezige speler","1 (Aanwezigheden)",null,"Strafschopdoelpunt","onderlijnd (Goals)",null,null,null,null,null,null,null,null,null,null,null,null,null,null,null,null,null,null,null,null,null,null,null,null,null,null,null,null,null,null,null,"Plaats 2",null,null,null,null,{"$f":"IF( AP$41 = 0, \"\", _xlfn.TEXTJOIN( \" / \",TRUE,  _xlfn._xlws.FILTER( $AK$5:$AK$39, AP$5:AP$39 = LARGE( _xlfn.UNIQUE( AP$5:AP$39 ), 2 ))))","v":"Hofmans Stijn"},{"$f":"IF( AQ$41 = 0, \"\", _xlfn.TEXTJOIN( \" / \",TRUE,  _xlfn._xlws.FILTER( $AK$5:$AK$39, AQ$5:AQ$39 = LARGE( _xlfn.UNIQUE( AQ$5:AQ$39 ), 2 ))))","v":"De Groof Maarten / Elst Pieter"},{"$f":"IF( AR$41 = 0, \"\", _xlfn.TEXTJOIN( \" / \",TRUE,  _xlfn._xlws.FILTER( $AK$5:$AK$39, AR$5:AR$39 = LARGE( _xlfn.UNIQUE( AR$5:AR$39 ), 2 ))))","v":"De Groof Maarten"},{"$f":"IF( AS$41 = 0, \"\", _xlfn.TEXTJOIN( \" / \",TRUE,  _xlfn._xlws.FILTER( $AK$5:$AK$39, AS$5:AS$39 = LARGE( _xlfn.UNIQUE( AS$5:AS$39 ), 2 ))))","v":"Nyckees Wannes"},{"$f":"IF( AT$41 = 0, \"\", _xlfn.TEXTJOIN( \" / \",TRUE,  _xlfn._xlws.FILTER( $AK$5:$AK$39, AT$5:AT$39 = LARGE( _xlfn.UNIQUE( AT$5:AT$39 ), 2 ))))","v":"Hofmans Stijn"},{"$f":"IF( AU$41 = 0, \"\", _xlfn.TEXTJOIN( \" / \",TRUE,  _xlfn._xlws.FILTER( $AK$5:$AK$39, AU$5:AU$39 = LARGE( _xlfn.UNIQUE( AU$5:AU$39 ), 2 ))))","v":"Celis Ive / De Groof Steven"},{"$f":"IF( AV$41 = 0, \"\", _xlfn.TEXTJOIN( \" / \",TRUE,  _xlfn._xlws.FILTER( $AK$5:$AK$39, AV$5:AV$39 = LARGE( _xlfn.UNIQUE( AV$5:AV$39 ), 2 ))))","v":""},{"$f":"IF( AW$41 = 0, \"\", _xlfn.TEXTJOIN( \" / \",TRUE,  _xlfn._xlws.FILTER( $AK$5:$AK$39, AW$5:AW$39 = LARGE( _xlfn.UNIQUE( AW$5:AW$39 ), 2 ))))","v":""},{"$f":"IF( AX$41 = 0, \"\", _xlfn.TEXTJOIN( \" / \",TRUE,  _xlfn._xlws.FILTER( $AK$5:$AK$39, AX$5:AX$39 = LARGE( _xlfn.UNIQUE( AX$5:AX$39 ), 2 ))))","v":""},{"$f":"IF( AY$41 = 0, \"\", _xlfn.TEXTJOIN( \" / \",TRUE,  _xlfn._xlws.FILTER( $AK$5:$AK$39, AY$5:AY$39 = LARGE( _xlfn.UNIQUE( AY$5:AY$39 ), 2 ))))","v":""},{"$f":"IF( AZ$41 = 0, \"\", _xlfn.TEXTJOIN( \" / \",TRUE,  _xlfn._xlws.FILTER( $AK$5:$AK$39, AZ$5:AZ$39 = LARGE( _xlfn.UNIQUE( AZ$5:AZ$39 ), 2 ))))","v":""},{"$f":"IF( BA$41 = 0, \"\", _xlfn.TEXTJOIN( \" / \",TRUE,  _xlfn._xlws.FILTER( $AK$5:$AK$39, BA$5:BA$39 = LARGE( _xlfn.UNIQUE( BA$5:BA$39 ), 2 ))))","v":""},{"$f":"IF( BB$41 = 0, \"\", _xlfn.TEXTJOIN( \" / \",TRUE,  _xlfn._xlws.FILTER( $AK$5:$AK$39, BB$5:BB$39 = LARGE( _xlfn.UNIQUE( BB$5:BB$39 ), 2 ))))","v":""},{"$f":"IF( BC$41 = 0, \"\", _xlfn.TEXTJOIN( \" / \",TRUE,  _xlfn._xlws.FILTER( $AK$5:$AK$39, BC$5:BC$39 = LARGE( _xlfn.UNIQUE( BC$5:BC$39 ), 2 ))))","v":""},{"$f":"IF( BD$41 = 0, \"\", _xlfn.TEXTJOIN( \" / \",TRUE,  _xlfn._xlws.FILTER( $AK$5:$AK$39, BD$5:BD$39 = LARGE( _xlfn.UNIQUE( BD$5:BD$39 ), 2 ))))","v":""},{"$f":"IF( BE$41 = 0, \"\", _xlfn.TEXTJOIN( \" / \",TRUE,  _xlfn._xlws.FILTER( $AK$5:$AK$39, BE$5:BE$39 = LARGE( _xlfn.UNIQUE( BE$5:BE$39 ), 2 ))))","v":""},{"$f":"IF( BF$41 = 0, \"\", _xlfn.TEXTJOIN( \" / \",TRUE,  _xlfn._xlws.FILTER( $AK$5:$AK$39, BF$5:BF$39 = LARGE( _xlfn.UNIQUE( BF$5:BF$39 ), 2 ))))","v":""},{"$f":"IF( BG$41 = 0, \"\", _xlfn.TEXTJOIN( \" / \",TRUE,  _xlfn._xlws.FILTER( $AK$5:$AK$39, BG$5:BG$39 = LARGE( _xlfn.UNIQUE( BG$5:BG$39 ), 2 ))))","v":""},{"$f":"IF( BH$41 = 0, \"\", _xlfn.TEXTJOIN( \" / \",TRUE,  _xlfn._xlws.FILTER( $AK$5:$AK$39, BH$5:BH$39 = LARGE( _xlfn.UNIQUE( BH$5:BH$39 ), 2 ))))","v":""},{"$f":"IF( BI$41 = 0, \"\", _xlfn.TEXTJOIN( \" / \",TRUE,  _xlfn._xlws.FILTER( $AK$5:$AK$39, BI$5:BI$39 = LARGE( _xlfn.UNIQUE( BI$5:BI$39 ), 2 ))))","v":""},{"$f":"IF( BJ$41 = 0, \"\", _xlfn.TEXTJOIN( \" / \",TRUE,  _xlfn._xlws.FILTER( $AK$5:$AK$39, BJ$5:BJ$39 = LARGE( _xlfn.UNIQUE( BJ$5:BJ$39 ), 2 ))))","v":""},{"$f":"IF( BK$41 = 0, \"\", _xlfn.TEXTJOIN( \" / \",TRUE,  _xlfn._xlws.FILTER( $AK$5:$AK$39, BK$5:BK$39 = LARGE( _xlfn.UNIQUE( BK$5:BK$39 ), 2 ))))","v":""},{"$f":"IF( BL$41 = 0, \"\", _xlfn.TEXTJOIN( \" / \",TRUE,  _xlfn._xlws.FILTER( $AK$5:$AK$39, BL$5:BL$39 = LARGE( _xlfn.UNIQUE( BL$5:BL$39 ), 2 ))))","v":""},{"$f":"IF( BM$41 = 0, \"\", _xlfn.TEXTJOIN( \" / \",TRUE,  _xlfn._xlws.FILTER( $AK$5:$AK$39, BM$5:BM$39 = LARGE( _xlfn.UNIQUE( BM$5:BM$39 ), 2 ))))","v":""},{"$f":"IF( BN$41 = 0, \"\", _xlfn.TEXTJOIN( \" / \",TRUE,  _xlfn._xlws.FILTER( $AK$5:$AK$39, BN$5:BN$39 = LARGE( _xlfn.UNIQUE( BN$5:BN$39 ), 2 ))))","v":""},{"$f":"IF( BO$41 = 0, \"\", _xlfn.TEXTJOIN( \" / \",TRUE,  _xlfn._xlws.FILTER( $AK$5:$AK$39, BO$5:BO$39 = LARGE( _xlfn.UNIQUE( BO$5:BO$39 ), 2 ))))","v":""}]
["Afwezige speler/supporter","a",null,"Niet van toepassing","(blanco)",null,null,null,null,null,null,null,null,null,null,null,null,null,null,null,null,null,null,null,null,null,null,null,null,null,null,null,null,null,null,null,"Plaats 3",null,null,null,null,{"$f":"IF( AP$41 = 0, \"\", _xlfn.TEXTJOIN( \" / \",TRUE,  _xlfn._xlws.FILTER( $AK$5:$AK$39, AP$5:AP$39 = LARGE( _xlfn.UNIQUE( AP$5:AP$39 ), 3 ))))","v":"Langenaeker Maarten"},{"$f":"IF( AQ$41 = 0, \"\", _xlfn.TEXTJOIN( \" / \",TRUE,  _xlfn._xlws.FILTER( $AK$5:$AK$39, AQ$5:AQ$39 = LARGE( _xlfn.UNIQUE( AQ$5:AQ$39 ), 3 ))))","v":"Jordens Koen"},{"$f":"IF( AR$41 = 0, \"\", _xlfn.TEXTJOIN( \" / \",TRUE,  _xlfn._xlws.FILTER( $AK$5:$AK$39, AR$5:AR$39 = LARGE( _xlfn.UNIQUE( AR$5:AR$39 ), 3 ))))","v":"Langenaeker Maarten"},{"$f":"IF( AS$41 = 0, \"\", _xlfn.TEXTJOIN( \" / \",TRUE,  _xlfn._xlws.FILTER( $AK$5:$AK$39, AS$5:AS$39 = LARGE( _xlfn.UNIQUE( AS$5:AS$39 ), 3 ))))","v":"Stevens Siebe"},{"$f":"IF( AT$41 = 0, \"\", _xlfn.TEXTJOIN( \" / \",TRUE,  _xlfn._xlws.FILTER( $AK$5:$AK$39, AT$5:AT$39 = LARGE( _xlfn.UNIQUE( AT$5:AT$39 ), 3 ))))","v":"Celis Ive"},{"$f":"IF( AU$41 = 0, \"\", _xlfn.TEXTJOIN( \" / \",TRUE,  _xlfn._xlws.FILTER( $AK$5:$AK$39, AU$5:AU$39 = LARGE( _xlfn.UNIQUE( AU$5:AU$39 ), 3 ))))","v":"Coolsaet Joy / Langenaeker Maarten"},{"$f":"IF( AV$41 = 0, \"\", _xlfn.TEXTJOIN( \" / \",TRUE,  _xlfn._xlws.FILTER( $AK$5:$AK$39, AV$5:AV$39 = LARGE( _xlfn.UNIQUE( AV$5:AV$39 ), 3 ))))","v":""},{"$f":"IF( AW$41 = 0, \"\", _xlfn.TEXTJOIN( \" / \",TRUE,  _xlfn._xlws.FILTER( $AK$5:$AK$39, AW$5:AW$39 = LARGE( _xlfn.UNIQUE( AW$5:AW$39 ), 3 ))))","v":""},{"$f":"IF( AX$41 = 0, \"\", _xlfn.TEXTJOIN( \" / \",TRUE,  _xlfn._xlws.FILTER( $AK$5:$AK$39, AX$5:AX$39 = LARGE( _xlfn.UNIQUE( AX$5:AX$39 ), 3 ))))","v":""},{"$f":"IF( AY$41 = 0, \"\", _xlfn.TEXTJOIN( \" / \",TRUE,  _xlfn._xlws.FILTER( $AK$5:$AK$39, AY$5:AY$39 = LARGE( _xlfn.UNIQUE( AY$5:AY$39 ), 3 ))))","v":""},{"$f":"IF( AZ$41 = 0, \"\", _xlfn.TEXTJOIN( \" / \",TRUE,  _xlfn._xlws.FILTER( $AK$5:$AK$39, AZ$5:AZ$39 = LARGE( _xlfn.UNIQUE( AZ$5:AZ$39 ), 3 ))))","v":""},{"$f":"IF( BA$41 = 0, \"\", _xlfn.TEXTJOIN( \" / \",TRUE,  _xlfn._xlws.FILTER( $AK$5:$AK$39, BA$5:BA$39 = LARGE( _xlfn.UNIQUE( BA$5:BA$39 ), 3 ))))","v":""},{"$f":"IF( BB$41 = 0, \"\", _xlfn.TEXTJOIN( \" / \",TRUE,  _xlfn._xlws.FILTER( $AK$5:$AK$39, BB$5:BB$39 = LARGE( _xlfn.UNIQUE( BB$5:BB$39 ), 3 ))))","v":""},{"$f":"IF( BC$41 = 0, \"\", _xlfn.TEXTJOIN( \" / \",TRUE,  _xlfn._xlws.FILTER( $AK$5:$AK$39, BC$5:BC$39 = LARGE( _xlfn.UNIQUE( BC$5:BC$39 ), 3 ))))","v":""},{"$f":"IF( BD$41 = 0, \"\", _xlfn.TEXTJOIN( \" / \",TRUE,  _xlfn._xlws.FILTER( $AK$5:$AK$39, BD$5:BD$39 = LARGE( _xlfn.UNIQUE( BD$5:BD$39 ), 3 ))))","v":""},{"$f":"IF( BE$41 = 0, \"\", _xlfn.TEXTJOIN( \" / \",TRUE,  _xlfn._xlws.FILTER( $AK$5:$AK$39, BE$5:BE$39 = LARGE( _xlfn.UNIQUE( BE$5:BE$39 ), 3 ))))","v":""},{"$f":"IF( BF$41 = 0, \"\", _xlfn.TEXTJOIN( \" / \",TRUE,  _xlfn._xlws.FILTER( $AK$5:$AK$39, BF$5:BF$39 = LARGE( _xlfn.UNIQUE( BF$5:BF$39 ), 3 ))))","v":""},{"$f":"IF( BG$41 = 0, \"\", _xlfn.TEXTJOIN( \" / \",TRUE,  _xlfn._xlws.FILTER( $AK$5:$AK$39, BG$5:BG$39 = LARGE( _xlfn.UNIQUE( BG$5:BG$39 ), 3 ))))","v":""},{"$f":"IF( BH$41 = 0, \"\", _xlfn.TEXTJOIN( \" / \",TRUE,  _xlfn._xlws.FILTER( $AK$5:$AK$39, BH$5:BH$39 = LARGE( _xlfn.UNIQUE( BH$5:BH$39 ), 3 ))))","v":""},{"$f":"IF( BI$41 = 0, \"\", _xlfn.TEXTJOIN( \" / \",TRUE,  _xlfn._xlws.FILTER( $AK$5:$AK$39, BI$5:BI$39 = LARGE( _xlfn.UNIQUE( BI$5:BI$39 ), 3 ))))","v":""},{"$f":"IF( BJ$41 = 0, \"\", _xlfn.TEXTJOIN( \" / \",TRUE,  _xlfn._xlws.FILTER( $AK$5:$AK$39, BJ$5:BJ$39 = LARGE( _xlfn.UNIQUE( BJ$5:BJ$39 ), 3 ))))","v":""},{"$f":"IF( BK$41 = 0, \"\", _xlfn.TEXTJOIN( \" / \",TRUE,  _xlfn._xlws.FILTER( $AK$5:$AK$39, BK$5:BK$39 = LARGE( _xlfn.UNIQUE( BK$5:BK$39 ), 3 ))))","v":""},{"$f":"IF( BL$41 = 0, \"\", _xlfn.TEXTJOIN( \" / \",TRUE,  _xlfn._xlws.FILTER( $AK$5:$AK$39, BL$5:BL$39 = LARGE( _xlfn.UNIQUE( BL$5:BL$39 ), 3 ))))","v":""},{"$f":"IF( BM$41 = 0, \"\", _xlfn.TEXTJOIN( \" / \",TRUE,  _xlfn._xlws.FILTER( $AK$5:$AK$39, BM$5:BM$39 = LARGE( _xlfn.UNIQUE( BM$5:BM$39 ), 3 ))))","v":""},{"$f":"IF( BN$41 = 0, \"\", _xlfn.TEXTJOIN( \" / \",TRUE,  _xlfn._xlws.FILTER( $AK$5:$AK$39, BN$5:BN$39 = LARGE( _xlfn.UNIQUE( BN$5:BN$39 ), 3 ))))","v":""},{"$f":"IF( BO$41 = 0, \"\", _xlfn.TEXTJOIN( \" / \",TRUE,  _xlfn._xlws.FILTER( $AK$5:$AK$39, BO$5:BO$39 = LARGE( _xlfn.UNIQUE( BO$5:BO$39 ), 3 ))))","v":""}]
["Aanwezige supporter","as",null,"Gele kaart"]
["Blessure","b",null,"Rechtstreekse rode kaart",null,null,null,null,null,null,null,null,null,null,null,null,null,null,null,null,null,null,null,null,null,null,null,null,null,null,null,null,null,null,null,null,"Aantal spelers met punten",null,null,null,null,{"$f":"COUNTIF(AP$5:AP$37,\">0\")","v":13},13,16,9,9,11,0,0,0,0,0,0,0,0,0,0,0,0,0,0,0,0,0,0,0,0]
["Keeper","k",null,"2 gele kaarten en dus rode kaart"]
["Niet aangesloten","na",null,"Gele kaart en nadien rechtstreekse rode kaart"]
["Niet gespeeld","ng",null,"Opmerking indien strafschopdoelpunt en 1 of meer extra doelpunten"]
["Ploegverantwoordelijke","p"]
["Schorsing","s",null,"Aantal forfaitnederlagen",0]
["Trainer","t"]
[]
[]
[]
[]
[]
[]
[]
[]
[]
[]
[]
[]
[]
[]
[]
[]
[]
[]
[]
[]
[]
[]
[]
[]
[]
[]
[]
[]
[]
[]
[]
[]
[]
[]
[]
[]
[]
[]
[]
[]
[]
[]
[]
[]
[null,{"$f":"B1","v":"Bar Patron (T)"},"Goka (U)","Alberta Schilde (T)","SC Duffel (U)","Hombeek (T)","Daltons (U)","Corum (T)","Sint Anneke (U)","Jolika (U)","Yerevan United (T)","Bariton (U)","Antwerp Global (T)","Racing Emblem (U)","Bar Patron (U)","SC Duffel (T)","Goka (T)","Alberta Schilde (U)","Hombeek (U)","Daltons (T)","Corum (U)","Sint Anneke (T)","Jolika (T)","Yerevan United (U)","Bariton (T)","Antwerp Global (U)","Racing Emblem (T)"]
[]
["Goals",{"$f":"SUM( B102:B134 )","v":2},0,1,1,5,0,0,0,0,0,0,0,0,0,0,0,0,0,0,0,0,0,0,0,0,0,null,null,null,null,null,null,null,null,null,{"$f":"_xlfn.LET( _xlpm.d, _xlfn.CHOOSECOLS( _xlfn.TAKE( _xlfn.SORTBY( A102:AB135, AB102:AB135, -1 ), 5 ), 1, -1 ),\n_xlpm.f, _xlfn._xlws.FILTER( _xlpm.d, _xlfn.TAKE( _xlpm.d, , -1 ) > 0, \"No data\" ),\n_xlfn.HSTACK( _xlfn.XLOOKUP( _xlfn.TAKE( _xlpm.f, , 1 ), $DZ$5:$DZ$37, $EA$5:$EA$37 ), _xlfn.TAKE( _xlpm.f, , -1 )) )","v":"Stijn Hofmans"},3]
[{"$f":"SUM( B100:AA100 )","v":9},null,null,null,null,null,null,null,null,null,null,null,null,null,null,null,null,null,null,null,null,null,null,null,null,null,null,null,null,null,null,null,null,null,null,null,"Jorn Verhellen",2]
[{"$f":"A5","v":"Beckx Pieter-Alexander"},null,null,null,null,null,null,null,null,null,null,null,null,null,null,null,null,null,null,null,null,null,null,null,null,null,null,{"$f":"SUM( B102:AA102 ) + COUNTIF( B102:AA102, \"ng\" )","v":0},null,null,null,null,null,null,null,null,"Wout Beirinckx",1]
[{"$f":"A6","v":"Beirinckx Geert"},null,null,null,null,null,null,null,null,null,null,null,null,null,null,null,null,null,null,null,null,null,null,null,null,null,null,{"$f":"SUM( B103:AA103 ) + COUNTIF( B103:AA103, \"ng\" )","v":0},null,null,null,null,null,null,null,null,"Maarten De Groof",1]
["Beirinckx Jurgen",null,null,null,null,null,null,null,null,null,null,null,null,null,null,null,null,null,null,null,null,null,null,null,null,null,null,0,null,null,null,null,null,null,null,null,"Glenn De Vinster",1]
["Beirinckx Wout",null,null,1,null,null,null,null,null,null,null,null,null,null,null,null,null,null,null,null,null,null,null,null,null,null,null,1]
["Boes Dieuwer",null,null,null,null,null,null,null,null,null,null,null,null,null,null,null,null,null,null,null,null,null,null,null,null,null,null,0]
["Celis Ive",null,null,null,null,null,null,null,null,null,null,null,null,null,null,null,null,null,null,null,null,null,null,null,null,null,null,0]
["Coolsaet Joy",null,null,null,null,null,null,null,null,null,null,null,null,null,null,null,null,null,null,null,null,null,null,null,null,null,null,0]
["De Clerck Tom",null,null,null,null,null,null,null,null,null,null,null,null,null,null,null,null,null,null,null,null,null,null,null,null,null,null,0]
["De Graeve Robbe",null,null,null,null,null,null,null,null,null,null,null,null,null,null,null,null,null,null,null,null,null,null,null,null,null,null,0]
["De Groof Maarten",null,null,null,1,null,null,null,null,null,null,null,null,null,null,null,null,null,null,null,null,null,null,null,null,null,null,1]
["De Groof Steven",null,null,null,null,null,null,null,null,null,null,null,null,null,null,null,null,null,null,null,null,null,null,null,null,null,null,0]
["De Swert Erlend",null,null,null,null,null,null,null,null,null,null,null,null,null,null,null,null,null,null,null,null,null,null,null,null,null,null,0]
["De Vinster Glenn",null,null,null,null,1,null,null,null,null,null,null,null,null,null,null,null,null,null,null,null,null,null,null,null,null,null,1]
["Delen Robbe",null,null,null,null,null,null,null,null,null,null,null,null,null,null,null,null,null,null,null,null,null,null,null,null,null,null,0]
["Elst Pieter",null,null,null,null,null,null,null,null,null,null,null,null,null,null,null,null,null,null,null,null,null,null,null,null,null,null,0]
["Gielis Bernd",null,null,null,null,null,null,null,null,null,null,null,null,null,null,null,null,null,null,null,null,null,null,null,null,null,null,0]
["Gielis Wim",null,null,null,null,null,null,null,null,null,null,null,null,null,null,null,null,null,null,null,null,null,null,null,null,null,null,0]
["Hofmans Stijn",1,null,null,null,2,null,null,null,null,null,null,null,null,null,null,null,null,null,null,null,null,null,null,null,null,null,3]
["Jordens Koen",null,null,null,null,null,null,null,null,null,null,null,null,null,null,null,null,null,null,null,null,null,null,null,null,null,null,0]
["Langenaeker Maarten",null,null,null,null,null,null,null,null,null,null,null,null,null,null,null,null,null,null,null,null,null,null,null,null,null,null,0]
["Lenaerts Jordy",null,null,null,null,null,null,null,null,null,null,null,null,null,null,null,null,null,null,null,null,null,null,null,null,null,null,0]
["Nyckees Wannes",null,null,null,null,null,null,null,null,null,null,null,null,null,null,null,null,null,null,null,null,null,null,null,null,null,null,0]
["Stevens Siebe",null,null,null,null,null,null,null,null,null,null,null,null,null,null,null,null,null,null,null,null,null,null,null,null,null,null,0]
["Tielemans Tom",null,null,null,null,null,null,null,null,null,null,null,null,null,null,null,null,null,null,null,null,null,null,null,null,null,null,0]
["Van de Vondel Rob",null,null,null,null,null,null,null,null,null,null,null,null,null,null,null,null,null,null,null,null,null,null,null,null,null,null,0]
["Van Den Brande Brent",null,null,null,null,null,null,null,null,null,null,null,null,null,null,null,null,null,null,null,null,null,null,null,null,null,null,0]
["Van Dessel Dieter",null,null,null,null,null,null,null,null,null,null,null,null,null,null,null,null,null,null,null,null,null,null,null,null,null,null,0]
["Van Gehuchten Vincent",null,null,null,null,null,null,null,null,null,null,null,null,null,null,null,null,null,null,null,null,null,null,null,null,null,null,0]
["Verdickt Stijn",null,null,null,null,null,null,null,null,null,null,null,null,null,null,null,null,null,null,null,null,null,null,null,null,null,null,0]
["Verhellen Jorn",null,null,null,null,2,null,null,null,null,null,null,null,null,null,null,null,null,null,null,null,null,null,null,null,null,null,2]
["Verlooy Kaïn",null,null,null,null,null,null,null,null,null,null,null,null,null,null,null,null,null,null,null,null,null,null,null,null,null,null,0]
["Vermeylen Jason",1,null,null,null,null,null,null,null,null,null,null,null,null,null,null,null,null,null,null,null,null,null,null,null,null,null,1]
[{"$f":"A37","v":"Own-goals/ff-goals"},null,null,null,null,null,null,null,null,null,null,null,null,null,null,null,null,null,null,null,null,null,null,null,null,null,null,0]
[]
[]
[]
[]
[]
[]
[]
[]
[]
[]
[]
[]
[]
[]
[]
["Assists",{"$f":"SUM( B152:B184 )","v":2},0,0,1,4,0,0,0,0,0,0,0,0,0,0,0,0,0,0,0,0,0,0,0,0,0,null,null,null,null,null,null,null,null,null,{"$f":"_xlfn.LET( _xlpm.d, _xlfn.CHOOSECOLS( _xlfn.TAKE( _xlfn.SORTBY( A152:AB185, AB152:AB185, -1 ), 5 ), 1, -1 ),\n_xlpm.f, _xlfn._xlws.FILTER( _xlpm.d, _xlfn.TAKE( _xlpm.d, , -1 ) > 0, \"No data\" ),\n_xlfn.HSTACK( _xlfn.XLOOKUP( _xlfn.TAKE( _xlpm.f, , 1 ), $DZ$5:$DZ$37, $EA$5:$EA$37 ), _xlfn.TAKE( _xlpm.f, , -1 )) )","v":"Glenn De Vinster"},2]
[{"$f":"SUM( B150:AA150 )","v":7},null,null,null,null,null,null,null,null,null,null,null,null,null,null,null,null,null,null,null,null,null,null,null,null,null,null,null,null,null,null,null,null,null,null,null,"Stijn Hofmans",2]
[{"$f":"A5","v":"Beckx Pieter-Alexander"},null,null,null,null,null,null,null,null,null,null,null,null,null,null,null,null,null,null,null,null,null,null,null,null,null,null,{"$f":"SUM( B152:AA152 ) + COUNTIF( B152:AA152, \"ng\" )","v":0},null,null,null,null,null,null,null,null,"Stijn Verdickt",2]
[{"$f":"A6","v":"Beirinckx Geert"},null,null,null,null,null,null,null,null,null,null,null,null,null,null,null,null,null,null,null,null,null,null,null,null,null,null,{"$f":"SUM( B153:AA153 ) + COUNTIF( B153:AA153, \"ng\" )","v":0},null,null,null,null,null,null,null,null,"Kaïn Verlooy",1]
["Beirinckx Jurgen",null,null,null,null,null,null,null,null,null,null,null,null,null,null,null,null,null,null,null,null,null,null,null,null,null,null,{"$f":"SUM( B154:AA154 ) + COUNTIF( B154:AA154, \"ng\" )","v":0}]
["Beirinckx Wout",null,null,null,null,null,null,null,null,null,null,null,null,null,null,null,null,null,null,null,null,null,null,null,null,null,null,0]
["Boes Dieuwer",null,null,null,null,null,null,null,null,null,null,null,null,null,null,null,null,null,null,null,null,null,null,null,null,null,null,0]
["Celis Ive",null,null,null,null,null,null,null,null,null,null,null,null,null,null,null,null,null,null,null,null,null,null,null,null,null,null,0]
["Coolsaet Joy",null,null,null,null,null,null,null,null,null,null,null,null,null,null,null,null,null,null,null,null,null,null,null,null,null,null,0]
["De Clerck Tom",null,null,null,null,null,null,null,null,null,null,null,null,null,null,null,null,null,null,null,null,null,null,null,null,null,null,0]
["De Graeve Robbe",null,null,null,null,null,null,null,null,null,null,null,null,null,null,null,null,null,null,null,null,null,null,null,null,null,null,0]
["De Groof Maarten",null,null,null,null,null,null,null,null,null,null,null,null,null,null,null,null,null,null,null,null,null,null,null,null,null,null,0]
["De Groof Steven",null,null,null,null,null,null,null,null,null,null,null,null,null,null,null,null,null,null,null,null,null,null,null,null,null,null,{"$f":"SUM( B162:AA162 ) + COUNTIF( B162:AA162, \"ng\" )","v":0}]
["De Swert Erlend",null,null,null,null,null,null,null,null,null,null,null,null,null,null,null,null,null,null,null,null,null,null,null,null,null,null,0]
["De Vinster Glenn",null,null,null,null,2,null,null,null,null,null,null,null,null,null,null,null,null,null,null,null,null,null,null,null,null,null,2]
["Delen Robbe",null,null,null,null,null,null,null,null,null,null,null,null,null,null,null,null,null,null,null,null,null,null,null,null,null,null,0]
["Elst Pieter",null,null,null,null,null,null,null,null,null,null,null,null,null,null,null,null,null,null,null,null,null,null,null,null,null,null,0]
["Gielis Bernd",null,null,null,null,null,null,null,null,null,null,null,null,null,null,null,null,null,null,null,null,null,null,null,null,null,null,0]
["Gielis Wim",null,null,null,null,null,null,null,null,null,null,null,null,null,null,null,null,null,null,null,null,null,null,null,null,null,null,0]
["Hofmans Stijn",1,null,null,null,1,null,null,null,null,null,null,null,null,null,null,null,null,null,null,null,null,null,null,null,null,null,2]
["Jordens Koen",null,null,null,null,null,null,null,null,null,null,null,null,null,null,null,null,null,null,null,null,null,null,null,null,null,null,0]
["Langenaeker Maarten",null,null,null,null,null,null,null,null,null,null,null,null,null,null,null,null,null,null,null,null,null,null,null,null,null,null,0]
["Lenaerts Jordy",null,null,null,null,null,null,null,null,null,null,null,null,null,null,null,null,null,null,null,null,null,null,null,null,null,null,0]
["Nyckees Wannes",null,null,null,null,null,null,null,null,null,null,null,null,null,null,null,null,null,null,null,null,null,null,null,null,null,null,0]
["Stevens Siebe",null,null,null,null,null,null,null,null,null,null,null,null,null,null,null,null,null,null,null,null,null,null,null,null,null,null,0]
["Tielemans Tom",null,null,null,null,null,null,null,null,null,null,null,null,null,null,null,null,null,null,null,null,null,null,null,null,null,null,0]
["Van de Vondel Rob",null,null,null,null,null,null,null,null,null,null,null,null,null,null,null,null,null,null,null,null,null,null,null,null,null,null,0]
["Van Den Brande Brent",null,null,null,null,null,null,null,null,null,null,null,null,null,null,null,null,null,null,null,null,null,null,null,null,null,null,0]
["Van Dessel Dieter",null,null,null,null,null,null,null,null,null,null,null,null,null,null,null,null,null,null,null,null,null,null,null,null,null,null,0]
["Van Gehuchten Vincent",null,null,null,null,null,null,null,null,null,null,null,null,null,null,null,null,null,null,null,null,null,null,null,null,null,null,0]
["Verdickt Stijn",1,null,null,1,null,null,null,null,null,null,null,null,null,null,null,null,null,null,null,null,null,null,null,null,null,null,2]
["Verhellen Jorn",null,null,null,null,null,null,null,null,null,null,null,null,null,null,null,null,null,null,null,null,null,null,null,null,null,null,0]
["Verlooy Kaïn",null,null,null,null,1,null,null,null,null,null,null,null,null,null,null,null,null,null,null,null,null,null,null,null,null,null,1]
["Vermeylen Jason",null,null,null,null,null,null,null,null,null,null,null,null,null,null,null,null,null,null,null,null,null,null,null,null,null,null,0]
[{"$f":"A37","v":"Own-goals/ff-goals"},null,null,null,null,null,null,null,null,null,null,null,null,null,null,null,null,null,null,null,null,null,null,null,null,null,null,0]
[]
[]
[]
[]
[]
[]
[]
[]
[]
[]
[]
[]
[]
[]
[]
["In actie",{"$f":"SUM( B202:B235 )","v":14},12,14,13,13,11,0,0,0,0,0,0,0,0,0,0,0,0,0,0,0,0,0,0,0,0,null,null,null,null,null,null,null,null,null,{"$f":"_xlfn.LET( _xlpm.d, _xlfn.CHOOSECOLS( _xlfn.TAKE( _xlfn.SORTBY( A202:AB235, AB202:AB235, -1 ), 5 ), 1, -1 ),\n_xlpm.f, _xlfn._xlws.FILTER( _xlpm.d, _xlfn.TAKE( _xlpm.d, , -1 ) > 0, \"No data\" ),\n_xlfn.HSTACK( _xlfn.XLOOKUP( _xlfn.TAKE( _xlpm.f, , 1 ), $DZ$5:$DZ$37, $EA$5:$EA$37 ), _xlfn.TAKE( _xlpm.f, , -1 )) )","v":"Maarten Langenaeker"},6]
[{"$f":"AVERAGEIF( B200:AA200, \">0\", B200:AA200 )","v":12.833333333333334},null,null,null,null,null,null,null,null,null,null,null,null,null,null,null,null,null,null,null,null,null,null,null,null,null,null,null,null,null,null,null,null,null,null,null,"Wout Beirinckx",5]
[{"$f":"A5","v":"Beckx Pieter-Alexander"},null,null,null,1,null,null,null,null,null,null,null,null,null,null,null,null,null,null,null,null,null,null,null,null,null,null,{"$f":"COUNTA( B202:AA202 )","v":1},null,null,null,null,null,null,null,null,"Dieuwer Boes",5]
[{"$f":"A6","v":"Beirinckx Geert"},null,null,null,null,null,null,null,null,null,null,null,null,null,null,null,null,null,null,null,null,null,null,null,null,null,null,{"$f":"COUNTA( B203:AA203 )","v":0},null,null,null,null,null,null,null,null,"Maarten De Groof",5]
["Beirinckx Jurgen",1,null,null,1,null,null,null,null,null,null,null,null,null,null,null,null,null,null,null,null,null,null,null,null,null,null,2,null,null,null,null,null,null,null,null,"Glenn De Vinster",5]
["Beirinckx Wout",null,1,1,1,1,1,null,null,null,null,null,null,null,null,null,null,null,null,null,null,null,null,null,null,null,null,5]
["Boes Dieuwer",1,1,1,1,null,1,null,null,null,null,null,null,null,null,null,null,null,null,null,null,null,null,null,null,null,null,5]
["Celis Ive",null,null,1,null,1,1,null,null,null,null,null,null,null,null,null,null,null,null,null,null,null,null,null,null,null,null,3]
["Coolsaet Joy",null,null,null,1,null,1,null,null,null,null,null,null,null,null,null,null,null,null,null,null,null,null,null,null,null,null,2]
["De Clerck Tom",null,null,null,null,null,null,null,null,null,null,null,null,null,null,null,null,null,null,null,null,null,null,null,null,null,null,0]
["De Graeve Robbe",1,1,null,null,null,null,null,null,null,null,null,null,null,null,null,null,null,null,null,null,null,null,null,null,null,null,2]
["De Groof Maarten",1,1,1,1,1,null,null,null,null,null,null,null,null,null,null,null,null,null,null,null,null,null,null,null,null,null,5]
["De Groof Steven",1,null,null,1,1,1,null,null,null,null,null,null,null,null,null,null,null,null,null,null,null,null,null,null,null,null,4]
["De Swert Erlend",null,1,null,null,null,1,null,null,null,null,null,null,null,null,null,null,null,null,null,null,null,null,null,null,null,null,2]
["De Vinster Glenn",1,1,1,null,1,1,null,null,null,null,null,null,null,null,null,null,null,null,null,null,null,null,null,null,null,null,5]
["Delen Robbe",null,null,1,null,null,null,null,null,null,null,null,null,null,null,null,null,null,null,null,null,null,null,null,null,null,null,{"$f":"COUNTA( B215:AA215 )","v":1}]
["Elst Pieter",1,1,1,null,1,null,null,null,null,null,null,null,null,null,null,null,null,null,null,null,null,null,null,null,null,null,4]
["Gielis Bernd",null,null,1,null,null,1,null,null,null,null,null,null,null,null,null,null,null,null,null,null,null,null,null,null,null,null,2]
["Gielis Wim",1,1,1,1,null,1,null,null,null,null,null,null,null,null,null,null,null,null,null,null,null,null,null,null,null,null,5]
["Hofmans Stijn",1,1,1,null,1,null,null,null,null,null,null,null,null,null,null,null,null,null,null,null,null,null,null,null,null,null,4]
["Jordens Koen",1,1,1,null,1,1,null,null,null,null,null,null,null,null,null,null,null,null,null,null,null,null,null,null,null,null,5]
["Langenaeker Maarten","k","k","k","k","k","k",null,null,null,null,null,null,null,null,null,null,null,null,null,null,null,null,null,null,null,null,6]
["Lenaerts Jordy",null,null,null,null,null,null,null,null,null,null,null,null,null,null,null,null,null,null,null,null,null,null,null,null,null,null,0]
["Nyckees Wannes",1,null,null,1,null,null,null,null,null,null,null,null,null,null,null,null,null,null,null,null,null,null,null,null,null,null,2]
["Stevens Siebe",null,null,null,1,null,null,null,null,null,null,null,null,null,null,null,null,null,null,null,null,null,null,null,null,null,null,1]
["Tielemans Tom",null,null,null,null,null,null,null,null,null,null,null,null,null,null,null,null,null,null,null,null,null,null,null,null,null,null,0]
["Van de Vondel Rob",null,null,null,null,null,null,null,null,null,null,null,null,null,null,null,null,null,null,null,null,null,null,null,null,null,null,0]
["Van Den Brande Brent",null,null,null,null,1,null,null,null,null,null,null,null,null,null,null,null,null,null,null,null,null,null,null,null,null,null,1]
["Van Dessel Dieter",1,1,1,null,1,1,null,null,null,null,null,null,null,null,null,null,null,null,null,null,null,null,null,null,null,null,5]
["Van Gehuchten Vincent",null,null,null,null,null,null,null,null,null,null,null,null,null,null,null,null,null,null,null,null,null,null,null,null,null,null,0]
["Verdickt Stijn",1,null,1,1,1,null,null,null,null,null,null,null,null,null,null,null,null,null,null,null,null,null,null,null,null,null,4]
["Verhellen Jorn",null,null,null,1,1,null,null,null,null,null,null,null,null,null,null,null,null,null,null,null,null,null,null,null,null,null,2]
["Verlooy Kaïn",null,null,1,1,1,null,null,null,null,null,null,null,null,null,null,null,null,null,null,null,null,null,null,null,null,null,3]
["Vermeylen Jason",1,1,null,null,null,null,null,null,null,null,null,null,null,null,null,null,null,null,null,null,null,null,null,null,null,null,2]
["Own-goals/ff-goals",null,null,null,null,null,null,null,null,null,null,null,null,null,null,null,null,null,null,null,null,null,null,null,null,null,null,0]
[]
[]
[]
[]
[]
[]
[]
[]
[]
[]
[]
[]
[]
[]
[]
["Kaarten",{"$f":"COUNTIF( B252:B284, \"geel\" )","v":1},0,1,1,0,0,0,0,0,0,0,0,0,0,0,0,0,0,0,0,0,0,0,0,0,0,null,null,null,null,null,null,null,null,null,{"$f":"_xlfn.LET( _xlpm.d, _xlfn.CHOOSECOLS( _xlfn.TAKE( _xlfn.SORTBY( A252:AB285, AB252:AB285, -1 ), 5 ), 1, -1 ),\n_xlpm.f, _xlfn._xlws.FILTER( _xlpm.d, _xlfn.TAKE( _xlpm.d, , -1 ) > 0, \"No data\" ),\n_xlfn.HSTACK( _xlfn.XLOOKUP( _xlfn.TAKE( _xlpm.f, , 1 ), $DZ$5:$DZ$37, $EA$5:$EA$37 ), _xlfn.TAKE( _xlpm.f, , -1 )) )","v":"Ive Celis"},1]
[{"$f":"SUM( B250:AA251 )","v":3},{"$f":"COUNTIF( B252:B284, \"rood\" )","v":0},0,0,0,0,0,0,0,0,0,0,0,0,0,0,0,0,0,0,0,0,0,0,0,0,0,null,null,null,null,null,null,null,null,null,"Robbe De Graeve",1]
[{"$f":"A5","v":"Beckx Pieter-Alexander"},null,null,null,null,null,null,null,null,null,null,null,null,null,null,null,null,null,null,null,null,null,null,null,null,null,null,{"$f":"COUNTIF( B252:AA252, \"<>\" )","v":0},null,null,null,null,null,null,null,null,"Siebe Stevens",1]
[{"$f":"A6","v":"Beirinckx Geert"},null,null,null,null,null,null,null,null,null,null,null,null,null,null,null,null,null,null,null,null,null,null,null,null,null,null,{"$f":"COUNTIF( B253:AA253, \"<>\" )","v":0}]
["Beirinckx Jurgen",null,null,null,null,null,null,null,null,null,null,null,null,null,null,null,null,null,null,null,null,null,null,null,null,null,null,{"$f":"COUNTIF( B254:AA254, \"<>\" )","v":0}]
["Beirinckx Wout",null,null,null,null,null,null,null,null,null,null,null,null,null,null,null,null,null,null,null,null,null,null,null,null,null,null,0]
["Boes Dieuwer",null,null,null,null,null,null,null,null,null,null,null,null,null,null,null,null,null,null,null,null,null,null,null,null,null,null,0]
["Celis Ive",null,null,"geel",null,null,null,null,null,null,null,null,null,null,null,null,null,null,null,null,null,null,null,null,null,null,null,1]
["Coolsaet Joy",null,null,null,null,null,null,null,null,null,null,null,null,null,null,null,null,null,null,null,null,null,null,null,null,null,null,0]
["De Clerck Tom",null,null,null,null,null,null,null,null,null,null,null,null,null,null,null,null,null,null,null,null,null,null,null,null,null,null,0]
["De Graeve Robbe","geel",null,null,null,null,null,null,null,null,null,null,null,null,null,null,null,null,null,null,null,null,null,null,null,null,null,1]
["De Groof Maarten",null,null,null,null,null,null,null,null,null,null,null,null,null,null,null,null,null,null,null,null,null,null,null,null,null,null,0]
["De Groof Steven",null,null,null,null,null,null,null,null,null,null,null,null,null,null,null,null,null,null,null,null,null,null,null,null,null,null,0]
["De Swert Erlend",null,null,null,null,null,null,null,null,null,null,null,null,null,null,null,null,null,null,null,null,null,null,null,null,null,null,{"$f":"COUNTIF( B263:AA263, \"<>\" )","v":0}]
["De Vinster Glenn",null,null,null,null,null,null,null,null,null,null,null,null,null,null,null,null,null,null,null,null,null,null,null,null,null,null,0]
["Delen Robbe",null,null,null,null,null,null,null,null,null,null,null,null,null,null,null,null,null,null,null,null,null,null,null,null,null,null,0]
["Elst Pieter",null,null,null,null,null,null,null,null,null,null,null,null,null,null,null,null,null,null,null,null,null,null,null,null,null,null,0]
["Gielis Bernd",null,null,null,null,null,null,null,null,null,null,null,null,null,null,null,null,null,null,null,null,null,null,null,null,null,null,0]
["Gielis Wim",null,null,null,null,null,null,null,null,null,null,null,null,null,null,null,null,null,null,null,null,null,null,null,null,null,null,0]
["Hofmans Stijn",null,null,null,null,null,null,null,null,null,null,null,null,null,null,null,null,null,null,null,null,null,null,null,null,null,null,0]
["Jordens Koen",null,null,null,null,null,null,null,null,null,null,null,null,null,null,null,null,null,null,null,null,null,null,null,null,null,null,0]
["Langenaeker Maarten",null,null,null,null,null,null,null,null,null,null,null,null,null,null,null,null,null,null,null,null,null,null,null,null,null,null,0]
["Lenaerts Jordy",null,null,null,null,null,null,null,null,null,null,null,null,null,null,null,null,null,null,null,null,null,null,null,null,null,null,0]
["Nyckees Wannes",null,null,null,null,null,null,null,null,null,null,null,null,null,null,null,null,null,null,null,null,null,null,null,null,null,null,0]
["Stevens Siebe",null,null,null,"geel",null,null,null,null,null,null,null,null,null,null,null,null,null,null,null,null,null,null,null,null,null,null,1]
["Tielemans Tom",null,null,null,null,null,null,null,null,null,null,null,null,null,null,null,null,null,null,null,null,null,null,null,null,null,null,0]
["Van de Vondel Rob",null,null,null,null,null,null,null,null,null,null,null,null,null,null,null,null,null,null,null,null,null,null,null,null,null,null,0]
["Van Den Brande Brent",null,null,null,null,null,null,null,null,null,null,null,null,null,null,null,null,null,null,null,null,null,null,null,null,null,null,0]
["Van Dessel Dieter",null,null,null,null,null,null,null,null,null,null,null,null,null,null,null,null,null,null,null,null,null,null,null,null,null,null,0]
["Van Gehuchten Vincent",null,null,null,null,null,null,null,null,null,null,null,null,null,null,null,null,null,null,null,null,null,null,null,null,null,null,0]
["Verdickt Stijn",null,null,null,null,null,null,null,null,null,null,null,null,null,null,null,null,null,null,null,null,null,null,null,null,null,null,0]
["Verhellen Jorn",null,null,null,null,null,null,null,null,null,null,null,null,null,null,null,null,null,null,null,null,null,null,null,null,null,null,0]
["Verlooy Kaïn",null,null,null,null,null,null,null,null,null,null,null,null,null,null,null,null,null,null,null,null,null,null,null,null,null,null,0]
["Vermeylen Jason",null,null,null,null,null,null,null,null,null,null,null,null,null,null,null,null,null,null,null,null,null,null,null,null,null,null,0]
[{"$f":"A37","v":"Own-goals/ff-goals"},null,null,null,null,null,null,null,null,null,null,null,null,null,null,null,null,null,null,null,null,null,null,null,null,null,null,0]
[]
[]
[]
[]
[]
[]
[]
[]
[]
[]
[]
[]
[]
[]
[]
["MVDM",{"$f":"SUM( B302:B334 )","v":89},75,100,61,69,70,0,0,0,0,0,0,0,0,0,0,0,0,0,0,0,0,0,0,0,0,null,null,null,null,null,null,null,null,null,{"$f":"_xlfn.LET( _xlpm.d, _xlfn.CHOOSECOLS( _xlfn.TAKE( _xlfn.SORTBY( A302:AB335, AB302:AB335, -1 ), 5 ), 1, -1 ),\n_xlpm.f, _xlfn._xlws.FILTER( _xlpm.d, _xlfn.TAKE( _xlpm.d, , -1 ) > 0, \"No data\" ),\n_xlfn.HSTACK( _xlfn.XLOOKUP( _xlfn.TAKE( _xlpm.f, , 1 ), $DZ$5:$DZ$37, $EA$5:$EA$37 ), _xlfn.TAKE( _xlpm.f, , -1 )) )","v":"Maarten Langenaeker"},50]
[{"$f":"SUM( B300:AA300 )","v":464},null,null,null,null,null,null,null,null,null,null,null,null,null,null,null,null,null,null,null,null,null,null,null,null,null,null,null,null,null,null,null,null,null,null,null,"Glenn De Vinster",47]
[{"$f":"A5","v":"Beckx Pieter-Alexander"},null,null,null,0,null,null,null,null,null,null,null,null,null,null,null,null,null,null,null,null,null,null,null,null,null,null,{"$f":"SUM( B302:AA302 )","v":0},null,null,null,null,null,null,null,null,"Maarten De Groof",41]
[{"$f":"A6","v":"Beirinckx Geert"},null,null,null,null,null,null,null,null,null,null,null,null,null,null,null,null,null,null,null,null,null,null,null,null,null,null,{"$f":"SUM( B303:AA303 )","v":0},null,null,null,null,null,null,null,null,"Stijn Hofmans",35]
["Beirinckx Jurgen",2,null,null,0,null,null,null,null,null,null,null,null,null,null,null,null,null,null,null,null,null,null,null,null,null,null,2,null,null,null,null,null,null,null,null,"Wannes Nyckees",32]
["Beirinckx Wout",null,7,7,1,0,6,null,null,null,null,null,null,null,null,null,null,null,null,null,null,null,null,null,null,null,null,21]
["Boes Dieuwer",0,4,1,3,null,6,null,null,null,null,null,null,null,null,null,null,null,null,null,null,null,null,null,null,null,null,14]
["Celis Ive",null,null,3,null,11,9,null,null,null,null,null,null,null,null,null,null,null,null,null,null,null,null,null,null,null,null,23]
["Coolsaet Joy",null,null,1,7,null,7,null,null,null,null,null,null,null,null,null,null,null,null,null,null,null,null,null,null,null,null,15]
["De Clerck Tom",null,null,null,null,null,null,null,null,null,null,null,null,null,null,null,null,null,null,null,null,null,null,null,null,null,null,0]
["De Graeve Robbe",4,2,null,null,null,null,null,null,null,null,null,null,null,null,null,null,null,null,null,null,null,null,null,null,null,null,6]
["De Groof Maarten",7,11,16,5,2,null,null,null,null,null,null,null,null,null,null,null,null,null,null,null,null,null,null,null,null,null,41]
["De Groof Steven",2,null,null,0,0,9,null,null,null,null,null,null,null,null,null,null,null,null,null,null,null,null,null,null,null,null,11]
["De Swert Erlend",null,5,null,null,null,4,null,null,null,null,null,null,null,null,null,null,null,null,null,null,null,null,null,null,null,null,9]
["De Vinster Glenn",7,12,7,null,16,5,null,null,null,null,null,null,null,null,null,null,null,null,null,null,null,null,null,null,null,null,47]
["Delen Robbe",null,null,20,null,null,null,null,null,null,null,null,null,null,null,null,null,null,null,null,null,null,null,null,null,null,null,20]
["Elst Pieter",7,11,11,null,2,null,null,null,null,null,null,null,null,null,null,null,null,null,null,null,null,null,null,null,null,null,31]
["Gielis Bernd",null,null,2,null,null,10,null,null,null,null,null,null,null,null,null,null,null,null,null,null,null,null,null,null,null,null,12]
["Gielis Wim",0,3,1,0,null,0,null,null,null,null,null,null,null,null,null,null,null,null,null,null,null,null,null,null,null,null,4]
["Hofmans Stijn",12,6,3,null,14,null,null,null,null,null,null,null,null,null,null,null,null,null,null,null,null,null,null,null,null,null,35]
["Jordens Koen",5,8,2,null,0,4,null,null,null,null,null,null,null,null,null,null,null,null,null,null,null,null,null,null,null,null,19]
["Langenaeker Maarten",11,2,13,15,2,7,null,null,null,null,null,null,null,null,null,null,null,null,null,null,null,null,null,null,null,null,50]
["Lenaerts Jordy",null,null,null,null,null,null,null,null,null,null,null,null,null,null,null,null,null,null,null,null,null,null,null,null,null,null,0]
["Nyckees Wannes",20,null,null,12,null,null,null,null,null,null,null,null,null,null,null,null,null,null,null,null,null,null,null,null,null,null,32]
["Stevens Siebe",null,null,null,9,null,null,null,null,null,null,null,null,null,null,null,null,null,null,null,null,null,null,null,null,null,null,9]
["Tielemans Tom",null,null,null,null,null,null,null,null,null,null,null,null,null,null,null,null,null,null,null,null,null,null,null,null,null,null,0]
["Van de Vondel Rob",null,null,null,null,null,null,null,null,null,null,null,null,null,null,null,null,null,null,null,null,null,null,null,null,null,null,0]
["Van Den Brande Brent",null,null,null,null,8,null,null,null,null,null,null,null,null,null,null,null,null,null,null,null,null,null,null,null,null,null,8]
["Van Dessel Dieter",4,3,2,null,6,3,null,null,null,null,null,null,null,null,null,null,null,null,null,null,null,null,null,null,null,null,18]
["Van Gehuchten Vincent",null,null,null,null,null,null,null,null,null,null,null,null,null,null,null,null,null,null,null,null,null,null,null,null,null,null,0]
["Verdickt Stijn",2,null,1,6,0,null,null,null,null,null,null,null,null,null,null,null,null,null,null,null,null,null,null,null,null,null,9]
["Verhellen Jorn",null,null,null,null,null,null,null,null,null,null,null,null,null,null,null,null,null,null,null,null,null,null,null,null,null,null,{"$f":"SUM( B331:AA331 )","v":0}]
["Verlooy Kaïn",null,null,10,3,8,null,null,null,null,null,null,null,null,null,null,null,null,null,null,null,null,null,null,null,null,null,21]
["Vermeylen Jason",6,1,null,null,null,null,null,null,null,null,null,null,null,null,null,null,null,null,null,null,null,null,null,null,null,null,7]
[{"$f":"A37","v":"Own-goals/ff-goals"},null,null,null,null,null,null,null,null,null,null,null,null,null,null,null,null,null,null,null,null,null,null,null,null,null,null,0]
[]
[]
[]
[]
[]
[]
[]
[]
[]
[]
[]
[]
[]
[]
[]
["MVDM - herwogen",{"$f":"SUM( B352:B385 )","v":98.8888888888889},100,100,81.333333333333343,81.17647058823529,100.00000000000001,0,0,0,0,0,0,0,0,0,0,0,0,0,0,0,0,0,0,0,0,null,null,null,null,null,null,null,null,null,{"$f":"_xlfn.LET( _xlpm.d, _xlfn.CHOOSECOLS( _xlfn.TAKE( _xlfn.SORTBY( A352:AB385, AB352:AB385, -1 ), 5 ), 1, -1 ),\n_xlpm.f, _xlfn._xlws.FILTER( _xlpm.d, _xlfn.TAKE( _xlpm.d, , -1 ) > 0, \"No data\" ),\n_xlfn.HSTACK( _xlfn.XLOOKUP( _xlfn.TAKE( _xlpm.f, , 1 ), $DZ$5:$DZ$37, $EA$5:$EA$37 ), _xlfn.TAKE( _xlpm.f, , -1 )) )","v":"Maarten Langenaeker"},60.241830065359473]
[{"$f":"SUM( B350:AA350 )","v":561.39869281045765},null,null,null,null,null,null,null,null,null,null,null,null,null,null,null,null,null,null,null,null,null,null,null,null,null,null,null,null,null,null,null,null,null,null,null,"Glenn De Vinster",56.744164332399627]
[{"$f":"A5","v":"Beckx Pieter-Alexander"},null,null,null,0,null,null,null,null,null,null,null,null,null,null,null,null,null,null,null,null,null,null,null,null,null,null,{"$f":"SUM( B352:AA352 )","v":0},null,null,null,null,null,null,null,null,"Maarten De Groof",47.464052287581694]
[{"$f":"A6","v":"Beirinckx Geert"},null,null,null,null,null,null,null,null,null,null,null,null,null,null,null,null,null,null,null,null,null,null,null,null,null,null,{"$f":"SUM( B353:AA353 )","v":0},null,null,null,null,null,null,null,null,"Stijn Hofmans",40.803921568627452]
["Beirinckx Jurgen",2.2222222222222223,null,null,0,null,null,null,null,null,null,null,null,null,null,null,null,null,null,null,null,null,null,null,null,null,null,{"$f":"SUM( B354:AA354 )","v":2.2222222222222223},null,null,null,null,null,null,null,null,"Wannes Nyckees",38.222222222222221]
["Beirinckx Wout",null,9.3333333333333339,7,1.3333333333333333,0,8.5714285714285712,null,null,null,null,null,null,null,null,null,null,null,null,null,null,null,null,null,null,null,null,26.238095238095241]
["Boes Dieuwer",0,5.333333333333333,1,4,null,8.5714285714285712,null,null,null,null,null,null,null,null,null,null,null,null,null,null,null,null,null,null,null,null,18.904761904761905]
["Celis Ive",null,null,3,null,12.941176470588236,12.857142857142858,null,null,null,null,null,null,null,null,null,null,null,null,null,null,null,null,null,null,null,null,28.798319327731093]
["Coolsaet Joy",null,null,1,9.3333333333333339,null,10,null,null,null,null,null,null,null,null,null,null,null,null,null,null,null,null,null,null,null,null,20.333333333333336]
["De Clerck Tom",null,null,null,null,null,null,null,null,null,null,null,null,null,null,null,null,null,null,null,null,null,null,null,null,null,null,0]
["De Graeve Robbe",4.4444444444444446,2.6666666666666665,null,null,null,null,null,null,null,null,null,null,null,null,null,null,null,null,null,null,null,null,null,null,null,null,7.1111111111111107]
["De Groof Maarten",7.7777777777777777,14.666666666666666,16,6.666666666666667,2.3529411764705883,null,null,null,null,null,null,null,null,null,null,null,null,null,null,null,null,null,null,null,null,null,47.464052287581694]
["De Groof Steven",2.2222222222222223,null,null,0,0,12.857142857142858,null,null,null,null,null,null,null,null,null,null,null,null,null,null,null,null,null,null,null,null,15.079365079365079]
["De Swert Erlend",null,6.666666666666667,null,null,null,5.7142857142857144,null,null,null,null,null,null,null,null,null,null,null,null,null,null,null,null,null,null,null,null,12.380952380952381]
["De Vinster Glenn",7.7777777777777777,16,7,null,18.823529411764707,7.1428571428571432,null,null,null,null,null,null,null,null,null,null,null,null,null,null,null,null,null,null,null,null,56.744164332399627]
["Delen Robbe",null,null,20,null,null,null,null,null,null,null,null,null,null,null,null,null,null,null,null,null,null,null,null,null,null,null,20]
["Elst Pieter",7.7777777777777777,14.666666666666666,11,null,2.3529411764705883,null,null,null,null,null,null,null,null,null,null,null,null,null,null,null,null,null,null,null,null,null,35.79738562091503]
["Gielis Bernd",null,null,2,null,null,14.285714285714286,null,null,null,null,null,null,null,null,null,null,null,null,null,null,null,null,null,null,null,null,16.285714285714285]
["Gielis Wim",0,4,1,0,null,0,null,null,null,null,null,null,null,null,null,null,null,null,null,null,null,null,null,null,null,null,5]
["Hofmans Stijn",13.333333333333334,8,3,null,16.470588235294116,null,null,null,null,null,null,null,null,null,null,null,null,null,null,null,null,null,null,null,null,null,40.803921568627452]
["Jordens Koen",5.5555555555555554,10.666666666666666,2,null,0,5.7142857142857144,null,null,null,null,null,null,null,null,null,null,null,null,null,null,null,null,null,null,null,null,23.936507936507937]
["Langenaeker Maarten",12.222222222222221,2.6666666666666665,13,20,2.3529411764705883,10,null,null,null,null,null,null,null,null,null,null,null,null,null,null,null,null,null,null,null,null,60.241830065359473]
["Lenaerts Jordy",null,null,null,null,null,null,null,null,null,null,null,null,null,null,null,null,null,null,null,null,null,null,null,null,null,null,0]
["Nyckees Wannes",22.222222222222221,null,null,16,null,null,null,null,null,null,null,null,null,null,null,null,null,null,null,null,null,null,null,null,null,null,38.222222222222221]
["Stevens Siebe",null,null,null,12,null,null,null,null,null,null,null,null,null,null,null,null,null,null,null,null,null,null,null,null,null,null,12]
["Tielemans Tom",null,null,null,null,null,null,null,null,null,null,null,null,null,null,null,null,null,null,null,null,null,null,null,null,null,null,0]
["Van de Vondel Rob",null,null,null,null,null,null,null,null,null,null,null,null,null,null,null,null,null,null,null,null,null,null,null,null,null,null,0]
["Van Den Brande Brent",null,null,null,null,9.4117647058823533,null,null,null,null,null,null,null,null,null,null,null,null,null,null,null,null,null,null,null,null,null,9.4117647058823533]
["Van Dessel Dieter",4.4444444444444446,4,2,null,7.0588235294117645,4.2857142857142856,null,null,null,null,null,null,null,null,null,null,null,null,null,null,null,null,null,null,null,null,21.788982259570496]
["Van Gehuchten Vincent",null,null,null,null,null,null,null,null,null,null,null,null,null,null,null,null,null,null,null,null,null,null,null,null,null,null,0]
["Verdickt Stijn",2.2222222222222223,null,1,8,0,null,null,null,null,null,null,null,null,null,null,null,null,null,null,null,null,null,null,null,null,null,11.222222222222221]
["Verhellen Jorn",null,null,null,null,null,null,null,null,null,null,null,null,null,null,null,null,null,null,null,null,null,null,null,null,null,null,0]
["Verlooy Kaïn",null,null,10,4,9.4117647058823533,null,null,null,null,null,null,null,null,null,null,null,null,null,null,null,null,null,null,null,null,null,23.411764705882355]
["Vermeylen Jason",6.666666666666667,1.3333333333333333,null,null,null,null,null,null,null,null,null,null,null,null,null,null,null,null,null,null,null,null,null,null,null,null,8]
[{"$f":"A37","v":"Own-goals/ff-goals"},null,null,null,null,null,null,null,null,null,null,null,null,null,null,null,null,null,null,null,null,null,null,null,null,null,null,0]
[]
[]
[]
[]
[]
[]
[]
[]
[]
[]
[]
[]
[]
[]
[]
[]
[]
[]
[]
[null,null,null,null,0]
[]
[null,2.2222222222222223]
[null,null,9.3333333333333339]
[null,0,5.333333333333333]
[]
[]
[]
[null,4.4444444444444446,2.6666666666666665]
[null,7.7777777777777777,14.666666666666666]
[null,2.2222222222222223]
[null,null,6.666666666666667]
[null,7.7777777777777777,16]
[]
[null,7.7777777777777777,14.666666666666666]
[]
[null,0,4]
[null,13.333333333333334,8]
[null,5.5555555555555554,10.666666666666666]
[null,12.222222222222221,2.6666666666666665]
[]
[null,22.222222222222221]
[]
[]
[]
[null,4.4444444444444446,4]
[]
[null,2.2222222222222223]
[]
[null,6.666666666666667,1.3333333333333333]

{"sheet":"Topschutters","index":4,"n_rows":6,"n_cols":4,"rows_kept":6,"cut":false,"hidden":false,"merged":[]}
[{"$f":"_xlfn.SORTBY( _xlfn._xlws.FILTER( spelersstatistieken!A5:A36, spelersstatistieken!AB102:AB133 > 0 ), _xlfn._xlws.FILTER( spelersstatistieken!AB102:AB133, spelersstatistieken!AB102:AB133 > 0 ), -1 )","v":"Hofmans Stijn"},{"$f":"INDEX( spelersstatistieken!AB5:AB36,_xlfn.ANCHORARRAY( D1) )","v":3},{"$f":"_xlfn.BYROW(_xlfn.ANCHORARRAY( D1), _xlfn.LAMBDA(_xlpm.r, _xlfn.TEXTJOIN( \", \", TRUE, IF( ISNUMBER( INDEX( spelersstatistieken!$B$102:$AA$133, _xlpm.r, 0 )), spelersstatistieken!$B$1:$AA$1 & \" (\" & INDEX( spelersstatistieken!$B$102:$AA$133, _xlpm.r, 0 ) & \")\", \"\" ))))","v":"Bar Patron (T) (1), Hombeek (T) (2)"},{"$f":"MATCH(_xlfn.ANCHORARRAY( A1), spelersstatistieken!$A$5:$A$36, 0 )","v":18}]
["Verhellen Jorn",0,"Hombeek (T) (2)",30]
["Beirinckx Wout",1,"Alberta Schilde (T) (1)",4]
["De Groof Maarten",1,"SC Duffel (U) (1)",10]
["De Vinster Glenn",1,"Hombeek (T) (1)",13]
["Vermeylen Jason",1,"Bar Patron (T) (1)",32]

{"sheet":"Stats","index":5,"n_rows":19,"n_cols":4,"rows_kept":19,"cut":false,"hidden":true,"merged":[]}
[null,"Albatros Paradeske"]
[null,"Aanwezigheden","Goals","Assists"]
["Van de Vondel Rob",1]
["Stevens Siebe",1,2]
["Langenaeker Maarten",1]
["De Groof Steven",1]
["De Groof Maarten",1]
["Hofmans Stijn",1,2]
["Van Dessel Dieter",1]
["Celis Ive",1,null,2]
["Verlooy Kaïn"]
["Beirinckx Wout",1,1]
["De Swert Erlend",1]
["Elst Pieter"]
["Verdickt Stijn",1]
["Gielis Bernd",1]
["Coolsaet Joy"]
["Boes Dieuwer",1]
["Beirinckx Jurgen","ng"]